program: Gaussian 09
title: 000036982
version: EM64L-G09RevD.01
frameworkgroup: C1[X(C12H8Cl2)]
method: RPBEPBE
basis: SDD
operation: Freq
keyword: #pfreq=noraman
keyword: PBEPBE/SDD
title: #p freq=noraman PBEPBE/SDD
converged: NO YES NO NO
title: Mulliken charges:
elementType: Cl Cl C C C C C C C C C C C C H H H H H H H H
charge: -0.046665 -0.058010 0.288537 0.364858 -0.347414 -0.347485 -0.308499 -0.358548 -0.202057 -0.202077 -0.219420 -0.228205 -0.104734 -0.224119 0.249835 0.249833 0.252190 0.256341 0.256341 0.257742 0.235075 0.236481
chargesum: 0.00000
title: Mulliken charges with hydrogens summed into heavy atoms:
elementType: Cl Cl C C C C C C C C C C C C
charge: -0.046665 -0.058010 0.288537 0.364858 -0.097580 -0.097652 -0.308499 -0.106358 0.054284 0.054263 0.038322 0.006870 -0.104734 0.012363
polarizability: 2.12347214e+02 -1.33896364e+01 1.17451010e+02 1.09882432e-02 3.64274232e-02 9.63582716e+01
1716.lowfreq: -42.0929 -2.2532 -0.0013 -0.0008 0.0013 6.3076 9.5789 45.8327 69.7815
frequency: -42.0852 45.8163 69.7715 137.0305 151.6285 214.5780 252.7376 284.6926 333.6990 368.2824 403.0834 413.8336 452.0197 462.8933 540.5295 548.9255 623.4596 634.6603 678.8711 718.9756 734.6786 752.9004 762.8957 827.7035 829.0444 868.0575 949.1296 949.9603 965.4099 985.8254 986.7229 1006.5940 1023.4820 1059.5629 1073.8089 1104.2639 1122.7504 1171.9749 1183.9018 1246.5502 1288.5224 1290.6638 1351.4936 1358.0395 1386.4303 1418.0915 1451.9795 1487.1972 1568.0538 1576.8299 1595.9238 1609.0044 3134.0558 3144.0120 3145.0346 3145.5554 3160.9056 3170.2150 3173.6852 3174.4015
redmass: 4.1787 11.3404 5.3212 10.5605 5.6042 8.1740 6.5929 8.9191 4.0733 7.6229 2.8974 6.5174 3.4372 8.6280 3.1083 3.7946 6.5735 6.7846 7.3497 3.7172 3.9411 6.2542 1.2722 1.5400 1.2449 1.3623 1.3746 1.3336 1.3678 7.3473 1.3242 4.2415 4.4004 2.4045 2.1881 1.3664 1.6527 1.0568 1.1198 1.5997 2.2140 1.2512 5.6144 8.0923 3.5550 2.1923 2.2622 3.0297 6.1555 7.7196 6.4793 7.1552 1.0858 1.0895 1.0897 1.0903 1.0954 1.0959 1.0971 1.0999
irintensity: 0.0483 0.1521 0.1979 0.8119 0.0000 0.1836 2.5001 1.3891 0.0892 6.9622 0.0009 2.9957 8.2760 10.8148 28.9325 2.1965 0.7494 1.0112 27.6061 2.9832 4.6869 14.0550 80.4899 54.4534 0.0847 0.0059 1.3031 0.1848 0.0650 43.8558 0.0000 32.2820 24.6721 15.2107 37.7087 8.5851 3.3330 0.3919 0.4298 2.7834 0.9742 0.2597 0.3646 2.9502 5.3194 23.6836 88.3989 25.9415 8.2667 1.1599 9.5056 2.5590 0.5774 4.2580 14.3651 2.0926 14.0124 7.0219 1.1755 14.0476
temp: 298.150 k
press: 1.00000 atm
elementType: 17 17 6 6 6 6 6 6 6 6 6 6 6 6 1 1 1 1 1 1 1 1
symmnumber: 1
zpe: 416125.8 jmol-1
zpe.correction: 0.158494 hartree
zpe.thermalcorrener: 0.169471 hartree
zpe.thermalcorrenthalpy: 0.170416 hartree
zpe.thermalcorrgfe: 0.120283 hartree
zpe.sumelectzpe: -1381.235922 hartree
zpe.sumelectthermal: -1381.224944 hartree
zpe.sumelectthermalent: -1381.224000 hartree
zpe.sumelectthermalfe: -1381.274132 hartree
dipole: 2.7992 -1.9166 0.0014
dipole: 3.3925
quadrupole: -91.8586 -94.6984 -90.1551
quadrupole: -3.4099 0.0030 0.0165
quadrupole: 0.3788 -2.4611 2.0823 -3.4099 0.0030 0.0165
hfenergy: -1381.3944155 hartree
pointgroup: C01 [X(C12H8Cl2)]
dipole: -1.1356434 -0.7012269 -0.0001186 debye
dipolederiv: -0.2442262 -0.218057 -0.0000549 -0.2053069 -0.6715559 -0.0000929 0.0000042 -0.0000908 -0.0614522 -0.9346682 -0.005934 0.0000059 -0.0136262 -0.0716442 0.0000797 -0.0000003 0.0000752 -0.1305278 0.2837801 -0.0414207 0.0000346 -0.0256321 -0.0481051 -0.0000431 -0.0000631 0.0000352 -0.0270014 0.3451688 -0.0911528 -0.000034 -0.0498951 -0.2292304 0.000048 -0.0000414 -0.0000024 -0.0531989 -0.0733962 0.0079818 0.0523852 -0.0107459 -0.1017749 -0.0167322 -0.074191 -0.0013671 0.084694 -0.0733076 0.0080763 -0.0523651 -0.0111388 -0.1019095 0.0162151 0.07423 0.0009012 0.0847215 0.1738686 0.3866429 0.0001048 0.2722061 0.9549426 0.0001811 0.0000543 0.0001358 -0.0531802 -0.1204432 0.0106578 -0.0000258 -0.0032772 0.0753766 0.0000488 -0.000063 0.0000364 -0.1236753 -0.3498183 0.002317 -0.0807563 0.0089791 -0.1033664 -0.0040003 -0.0584751 -0.0019572 -0.0054991 -0.3499209 0.0021248 0.0807363 0.0089255 -0.103397 0.0037049 0.0585804 0.0016305 -0.0055175 -0.1501167 -0.1561139 -0.000034 -0.0990957 -0.1759625 -0.0000309 -0.000063 -0.0000121 -0.1031331 -0.0828648 0.063455 0.000005 0.0478103 0.0546429 0.0000018 0.0001197 0.0000286 -0.1522426 1.3386789 0.0175557 -0.0000011 0.0222575 -0.0671691 -0.00026 -0.000049 -0.0002458 0.1250318 0.0989999 -0.0197967 -0.0000002 0.0190151 0.0312402 0.0000228 0.0000025 0.000019 -0.1522518 0.0430952 -0.0057428 -0.0850172 -0.0061567 0.1336922 0.0031453 -0.0866252 0.0012166 -0.0204981 0.0431094 -0.005992 0.0850319 -0.0063954 0.133708 -0.002683 0.0866106 -0.0008238 -0.0205379 0.0516406 0.0842008 -0.0000059 0.094112 -0.0280676 -0.0000358 -0.0000029 0.0000043 0.1363317 0.032371 0.0000688 0.0685022 -0.0035747 0.1603693 0.0021627 0.0650988 0.0003269 -0.0027607 0.0323628 0.0002543 -0.0685083 -0.003351 0.1603792 -0.0016874 -0.0651104 0.0001284 -0.002764 0.0381775 0.0551976 0.0000035 0.0751239 -0.0064156 -0.0000152 0.0000018 -0.000013 0.1611189 0.0199248 -0.0753477 -0.0000062 -0.0959283 -0.0707254 -0.0000203 -0.0000124 -0.0000212 0.1608647 -0.1224156 -0.0189751 -0.0000004 -0.0143055 0.0749726 -0.0000089 -0.0000057 -0.0000045 0.161478 unknown
polarizability: 213.3980748|8.8575081|116.4001018|0.0009204|-0.048399|96.3583191 unknown
InChI: InChI=1S/C12H8Cl2/c13-10-7-5-9(6-8-10)11-3-1-2-4-12(11)14/h1-8H
charge 0 multiplicity 1
22 atoms
Cl -1.115177 2.601122 0.000165
Cl 5.073682 -0.064685 -0.000131
C  0.430362 -0.148597 -0.000122
C  -1.069901 -0.20987 -0.000147
C  1.151758 -0.133933 -1.221137
C  1.151819 -0.137338 1.220885
C  -1.88918 0.946338 -0.000039
C  -1.730538 -1.468377 -0.000226
C  2.564397 -0.107463 -1.230423
C  2.564465 -0.110893 1.230177
C  -3.296962 0.878761 -0.000039
C  -3.139486 -1.563017 -0.000226
C  3.248991 -0.096797 -0.000124
C  -3.924236 -0.387221 -0.000138
H  0.608542 -0.137818 -2.172233
H  0.608657 -0.143863 2.172001
H  -1.115426 -2.375098 -0.000305
H  3.118504 -0.09438 -2.173498
H  3.118619 -0.10047 2.173255
H  -3.886864 1.80011 0.000045
H  -3.620064 -2.546935 -0.000301
H  -5.01786 -0.446976 -0.000136
