program: Gaussian 09
title: 000036981
version: EM64L-G09RevD.01
frameworkgroup: C1[X(C12H8Cl2)]
method: RPBEPBE
basis: SDD
operation: Freq
keyword: #pfreq=noraman
keyword: PBEPBE/SDD
title: #p freq=noraman PBEPBE/SDD
converged: NO YES NO YES
title: Mulliken charges:
elementType: Cl Cl C C C C C C C C C C C C H H H H H H H H
charge: -0.051113 -0.051112 0.313689 0.270023 -0.375999 -0.375995 -0.377121 -0.377120 -0.049998 -0.049997 -0.215431 -0.215429 -0.235117 -0.236026 0.277778 0.277778 0.246676 0.246675 0.284210 0.230660 0.230660 0.232308
chargesum: 0.00000
title: Mulliken charges with hydrogens summed into heavy atoms:
elementType: Cl Cl C C C C C C C C C C C C
charge: -0.051113 -0.051112 0.313689 0.270023 -0.098221 -0.098217 -0.130445 -0.130444 -0.049998 -0.049997 0.015229 0.015231 0.049094 -0.003719
polarizability: 1.99341777e+02 1.14560525e-03 1.36740896e+02 3.08316308e-03 2.57482313e-04 9.70600173e+01
1716.lowfreq: -48.8953 -4.9091 -4.4975 -0.0033 -0.0021 -0.0018 7.9540 62.3170 68.2489
frequency: -48.8779 62.3142 68.2457 162.1103 162.9232 186.2811 224.5322 277.2364 294.8726 376.6349 379.3319 396.6520 408.2203 516.5982 548.2802 577.3122 615.6884 622.3713 689.1703 704.0508 743.7366 776.6098 792.0421 852.1302 864.3888 882.1845 893.5234 921.3094 974.1414 978.6467 987.7242 997.0294 1019.5267 1059.1492 1077.8838 1090.7161 1104.3758 1173.4194 1187.7923 1251.4933 1277.2000 1310.8902 1356.0283 1368.3260 1397.1057 1427.0130 1428.2891 1486.0517 1555.6503 1583.4109 1592.4149 1612.5274 3124.5665 3129.9950 3141.6194 3150.8412 3165.6838 3169.7657 3172.3006 3184.3122
redmass: 4.0932 6.9235 5.9748 17.7809 6.7426 4.7464 5.5833 8.7334 4.1530 11.8016 4.4287 2.8313 9.3495 5.5267 3.3008 5.0728 5.9732 7.4103 2.4913 1.8456 3.9190 2.5102 7.4792 1.2438 1.4570 1.4989 1.3435 1.3999 1.3835 6.4773 6.2475 1.3120 3.1478 2.5842 1.6046 1.4968 1.9352 1.0532 1.1161 1.1885 2.7398 1.3683 8.6135 6.8596 3.0264 2.9121 2.1976 2.7272 7.1305 6.0077 7.4550 6.3332 1.0847 1.0879 1.0926 1.0969 1.1018 1.0928 1.0938 1.0941
irintensity: 0.0000 0.1521 0.0073 0.7696 0.0506 0.0000 0.2043 0.1026 0.2732 6.2087 0.1390 0.0000 8.4947 0.0000 13.5432 0.9243 1.9804 12.1005 20.4373 32.4003 159.8518 0.2278 17.2170 0.0000 37.0516 15.1970 0.0000 0.3087 0.0000 2.5073 1.9525 0.0537 1.9642 22.4377 7.6071 9.6954 7.5915 0.0228 1.3752 0.0563 15.2699 0.6043 3.4708 0.0264 43.4774 28.9071 8.4117 14.5390 130.3734 1.4505 93.6915 0.0931 1.7130 0.0995 15.5654 34.3242 21.7736 0.0001 0.0956 1.0340
temp: 298.150 k
press: 1.00000 atm
elementType: 17 17 6 6 6 6 6 6 6 6 6 6 6 6 1 1 1 1 1 1 1 1
symmnumber: 1
zpe: 415909.5 jmol-1
zpe.correction: 0.158412 hartree
zpe.thermalcorrener: 0.169436 hartree
zpe.thermalcorrenthalpy: 0.170380 hartree
zpe.thermalcorrgfe: 0.120157 hartree
zpe.sumelectzpe: -1381.235916 hartree
zpe.sumelectthermal: -1381.224891 hartree
zpe.sumelectthermalent: -1381.223947 hartree
zpe.sumelectthermalfe: -1381.274171 hartree
dipole: 2.5628 0.0000 0.0001
dipole: 2.5628
quadrupole: -87.1142 -101.4622 -91.1330
quadrupole: 0.0001 0.0000 0.0036
quadrupole: 6.1223 -8.2257 2.1035 0.0001 0.0000 0.0036
hfenergy: -1381.3943273 hartree
pointgroup: C01 [X(C12H8Cl2)]
dipole: -1.0082879 0.0000252 -0.0000475 debye
dipolederiv: -0.3666556 -0.3058148 -0.0000701 -0.3661073 -0.6636001 -0.0001302 -0.0000873 -0.0001309 -0.0663489 -0.3666519 0.3058178 0.000044 0.3661063 -0.6636092 -0.0000903 0.0000589 -0.0000858 -0.0663486 0.4417265 -0.0000073 0.0000123 -0.0000216 0.2376438 0.0000621 0.0000119 0.0000459 -0.0592159 0.2995018 0.0000024 0.0000093 0.0000293 -0.1062329 -0.0000333 0.0000117 -0.0000157 0.0060153 -0.4099203 0.1639963 0.0000209 0.162978 -0.2355977 -0.0000196 0.0000274 -0.0000123 -0.1017789 -0.4099315 -0.1639881 -0.0000427 -0.1629732 -0.2355946 -0.0000389 -0.0000417 -0.0000455 -0.1017787 -0.1758463 0.0000189 -0.0765614 -0.0000456 -0.127068 -0.0000585 0.0175055 -0.0000594 0.0523356 -0.1758492 -0.0000298 0.076548 0.0000152 -0.1270675 -0.0000688 -0.0175179 -0.000062 0.0523374 0.5759927 0.410806 0.000111 0.5024061 1.0172582 0.0002341 0.0001573 0.0002402 -0.035998 0.5759839 -0.410807 -0.000055 -0.5024068 1.0172725 0.0001596 -0.0000928 0.0001626 -0.0359979 -0.0249913 -0.0000333 0.0806958 -0.0000144 -0.1391593 -0.0000753 0.0579922 -0.0000805 0.0837885 -0.0249846 0.0000189 -0.0807021 0.0000028 -0.1391587 -0.0000728 -0.0579989 -0.0000711 0.0837838 -0.2248194 -0.0000013 -0.0000121 0.0000024 -0.5647375 -0.0000889 -0.0000173 -0.0000869 -0.0974847 0.0978742 -0.0000127 0.0000047 -0.000011 -0.1616114 -0.0000309 0.0000043 -0.0000319 -0.0709719 0.0936042 -0.0555861 -0.0000058 -0.0714754 0.0218915 -0.000022 -0.0000129 -0.0000211 0.1467241 0.093604 0.0555869 0.000002 0.0714762 0.0218902 -0.0000177 0.0000016 -0.0000175 0.1467223 0.0604253 -0.0000303 0.0948554 -0.0000278 0.1351655 0.0000598 0.0937758 0.0000538 -0.033327 0.0604345 0.0000404 -0.0948498 0.0000367 0.1351648 0.0000659 -0.0937708 0.0000595 -0.0333361 0.0168866 -0.0000004 -0.0000013 -0.0000017 0.1077588 -0.0000116 -0.0000061 -0.0000164 0.1761218 0.0023564 0.0000342 -0.0850817 0.0000476 0.1542699 0.000079 -0.104696 0.0000796 -0.066855 0.0023468 -0.0000235 0.0850845 -0.000028 0.1542694 0.0000746 0.1047007 0.0000711 -0.066847 -0.1410867 0.0000131 -0.0000061 0.0000122 0.1608524 0.0000238 -0.0000058 0.0000241 0.0884599 unknown
polarizability: 199.341777|-0.002707|136.7408958|0.0030832|-0.0002576|97.0600173 unknown
InChI: InChI=1S/C12H8Cl2/c13-11-6-10(7-12(14)8-11)9-4-2-1-3-5-9/h1-8H
charge 0 multiplicity 1
22 atoms
Cl 3.256235 2.777012 0.000618
Cl 3.256219 -2.77712 -0.000372
C  0.221649 -0.000045 -0.000005
C  -1.281974 -0.00004 -0.000043
C  0.935253 -1.227001 -0.000145
C  0.93526 1.226903 0.000198
C  -2.001174 0.000424 -1.223483
C  -2.001237 -0.000425 1.223362
C  2.342728 1.200188 0.00025
C  2.342721 -1.200295 -0.000139
C  -3.41478 0.000483 -1.222708
C  -3.414843 -0.000356 1.222511
C  3.07986 -0.000058 0.00005
C  -4.125567 0.000098 -0.000115
H  0.395986 -2.178203 -0.000291
H  0.395992 2.178106 0.000312
H  -1.450951 0.000737 -2.171381
H  -1.451061 -0.000782 2.171289
H  4.172309 -0.00005 0.000058
H  -3.958408 0.000833 -2.174173
H  -3.958516 -0.000657 2.173951
H  -5.221301 0.000148 -0.000143
