program: Gaussian 09
title: 000000799
version: EM64L-G09RevD.01
frameworkgroup: C1[X(C11H14NO6P)]
method: RPBEPBE
basis: SDD
operation: Freq
keyword: #p
keyword: freq=noraman
keyword: PBEPBE/SDD
title: #p freq=noraman PBEPBE/SDD
converged: YES YES NO NO
title: Mulliken charges:
elementType: P O O O O O O N C C C C C C C C C C C H H H H H H H H H H H H H H
charge: 1.378413 -0.430720 -0.526097 -0.498429 -0.697046 -0.681715 -0.605298 -0.400437 -0.211693 0.222284 -0.069761 0.133479 0.237692 -0.430757 -0.313009 -0.395706 -0.341617 -0.256311 -0.208044 0.212376 0.281876 0.215775 0.260311 0.313524 0.318480 0.229729 0.235905 0.344677 0.387020 0.229570 0.230263 0.396994 0.438273
chargesum: 0.00000
title: Mulliken charges with hydrogens summed into heavy atoms:
elementType: P O O O O O O N C C C C C C C C C C C
charge: 1.378413 -0.086043 -0.139077 -0.498429 -0.300052 -0.243442 -0.605298 -0.081957 0.000683 0.222284 0.212114 0.133479 0.237692 -0.117233 0.163076 -0.165977 -0.105712 -0.026741 0.022219
polarizability: 1.81707275e+02 -2.31201131e+01 1.72968493e+02 -1.26535880e+01 -1.62586263e+01 1.43074409e+02
1716.lowfreq: -10.1284 -3.4283 0.0009 0.0011 0.0014 4.0062 21.1229 24.0437 42.3706
frequency: 20.9812 23.8205 42.1733 51.7121 86.7439 94.8401 129.5749 141.3511 172.2576 187.6105 198.5957 222.0806 238.7728 266.5160 288.7246 296.1055 338.9062 342.1934 358.8087 370.9298 380.0190 423.0045 431.7231 441.3208 456.0045 504.5566 552.8004 553.2750 560.3837 577.9358 606.2385 629.8889 669.5463 680.5390 744.2167 754.3645 766.0303 784.8413 803.9284 827.8364 849.6385 854.7975 868.5399 916.6529 938.0769 939.8175 965.7591 979.4800 984.6647 991.9036 1012.2347 1043.3752 1062.9620 1087.0974 1092.5273 1100.8257 1135.5877 1170.5182 1184.2270 1222.7379 1230.3302 1236.1790 1249.6215 1278.7558 1293.5472 1299.9044 1322.8604 1354.4497 1355.8018 1367.2224 1379.4354 1396.1369 1422.8329 1447.1223 1455.3149 1485.7567 1540.5488 1585.8591 1631.9609 2812.5521 2943.2551 3001.3352 3069.8407 3086.6796 3128.4952 3136.0177 3150.1009 3168.1855 3228.7429 3437.0608 3552.3126 3606.8213 3606.9753
redmass: 7.2160 6.5709 6.1117 4.2996 2.0045 4.6555 6.0425 5.9639 5.0542 4.3734 4.2212 4.1140 5.5375 4.0587 4.7449 4.6377 3.0989 1.5394 6.9277 5.2870 4.6687 2.8153 2.3108 1.6630 3.8158 3.6096 1.7515 5.2629 3.2617 2.3458 7.0502 4.9814 5.3429 5.7029 4.5678 1.4088 4.0533 6.5859 4.8549 2.2129 1.5364 1.5359 5.0570 1.4183 1.4123 5.4199 2.0001 1.3097 1.3711 5.9538 2.1262 2.9574 3.7800 4.6437 2.3157 1.6239 1.3988 1.0936 1.2089 1.1944 1.2640 2.1035 1.5311 1.2997 1.6618 1.9582 1.2245 1.5592 1.2963 1.4047 1.3537 3.9665 2.3412 1.0871 3.8393 3.0229 5.4371 6.1276 7.0099 1.0704 1.0837 1.0582 1.1008 1.0927 1.0862 1.0889 1.0951 1.1001 1.0984 1.0650 1.0659 1.0802 1.0672
irintensity: 0.8449 3.2393 3.1076 14.2122 70.5877 7.9248 8.9016 8.4984 2.9656 12.3466 1.7197 15.0741 7.2575 10.7244 15.8094 12.3289 86.7328 78.6250 18.8971 8.8723 39.1130 21.6249 37.5952 72.6246 9.9755 7.7528 46.5342 13.7433 28.8530 26.8218 48.9745 7.8766 58.1279 142.0045 12.6303 111.5375 11.6964 53.3329 93.7026 53.9317 25.6066 1.4677 0.7558 92.6963 15.1251 127.8680 42.5533 0.2215 6.4122 112.4375 8.0419 46.6840 19.9539 174.0522 15.2432 31.0297 2.3100 0.6710 38.9773 21.1484 3.5435 27.2515 11.5539 38.5219 6.2491 34.5035 270.2264 25.6225 34.3661 1.5364 30.1125 51.0988 6.7111 8.0990 18.2232 0.9349 22.8572 1.1734 3.4516 1251.3119 33.1531 38.6722 3.6984 13.3714 4.3683 2.1597 27.3777 20.7908 2.7657 173.9987 8.1970 73.4943 56.9736
temp: 298.150 k
press: 1.00000 atm
elementType: 15 8 8 8 8 8 8 7 6 6 6 6 6 6 6 6 6 6 6 1 1 1 1 1 1 1 1 1 1 1 1 1 1
symmnumber: 1
zpe: 644096.9 jmol-1
zpe.correction: 0.245324 hartree
zpe.thermalcorrener: 0.264342 hartree
zpe.thermalcorrenthalpy: 0.265287 hartree
zpe.thermalcorrgfe: 0.196516 hartree
zpe.sumelectzpe: -1273.455741 hartree
zpe.sumelectthermal: -1273.436722 hartree
zpe.sumelectthermalent: -1273.435778 hartree
zpe.sumelectthermalfe: -1273.504549 hartree
dipole: 11.4114 -0.0060 -0.9842
dipole: 11.4538
quadrupole: -147.4884 -111.7632 -108.4407
quadrupole: 1.6764 -10.2198 -1.2409
quadrupole: -24.9243 10.8009 14.1234 1.6764 -10.2198 -1.2409
hfenergy: -1273.7010647 hartree
pointgroup: C01 [X(C11H14N1O6P1)]
dipole: -4.4911865 0.2658973 -0.2547698 debye
polarizability: 179.9182112|-24.5278755|170.672363|9.5573356|19.7791045|147.1596027 unknown
InChI: InChI=1S/C11H14NO6P/c13-10(6-18-19(15,16)17)11(14)8-5-12-9-4-2-1-3-7(8)9/h1-5,10-16H,6H2
charge 0 multiplicity 1
33 atoms
P  3.961708 0.728227 -0.26898
O  -0.37359 -3.237531 0.503242
O  1.423782 -1.30279 -1.025883
O  3.199738 -0.058727 1.091979
O  2.810425 2.002522 -0.58396
O  3.750892 -0.329997 -1.561694
O  5.431423 1.218396 0.025533
N  -2.626891 -0.320935 -1.700626
C  -0.238212 -1.7949 0.774677
C  -1.237353 -0.980323 -0.013045
C  1.242512 -1.459135 0.434286
C  -1.883029 0.261759 0.38221
C  -2.749288 0.651759 -0.699426
C  -1.71497 -1.298459 -1.293447
C  1.732409 -0.201271 1.178859
C  -1.820478 1.08008 1.542979
C  -3.540651 1.820635 -0.654059
C  -2.610188 2.243143 1.595845
C  -3.459017 2.61064 0.509046
H  -0.382922 -1.599148 1.860057
H  1.863299 -2.32649 0.713379
H  1.544071 -0.311819 2.261743
H  1.235223 0.713885 0.803873
H  -1.498904 -2.171486 -1.906586
H  -3.128227 -0.319532 -2.586619
H  -1.173683 0.814696 2.386899
H  -4.192902 2.108429 -1.485658
H  -1.325335 -3.488606 0.623505
H  0.607645 -0.87667 -1.40775
H  -2.574629 2.883076 2.48389
H  -4.057297 3.525193 0.581797
H  3.217346 2.905273 -0.581591
H  2.848395 -0.835795 -1.509175
