program: Gaussian 09
title: 000037015
version: EM64L-G09RevD.01
frameworkgroup: C1[X(C15H22N4O2)]
method: RPBEPBE
basis: SDD
operation: Freq
keyword: #p
keyword: freq=noraman
keyword: PBEPBE/SDD
title: #p freq=noraman PBEPBE/SDD
converged: YES YES NO NO
title: Mulliken charges:
elementType: O O N N N N C C C C C C C C C C C C C C C H H H H H H H H H H H H H H H H H H H H H H
charge: -0.284829 -0.342368 -0.404036 -0.176273 -0.035656 -0.016230 0.323029 0.091404 -0.360966 -0.421993 0.029901 0.060469 -0.349099 -0.410553 -0.346784 -0.448332 -0.683122 0.202097 -0.661064 -0.218454 -0.674102 0.218103 0.230857 0.201351 0.210859 0.379038 0.196790 0.217106 0.266241 0.248983 0.230261 0.276526 0.206468 0.221127 0.213331 0.241385 0.214309 0.227416 0.227068 0.226968 0.210888 0.231003 0.230883
chargesum: 0.00000
title: Mulliken charges with hydrogens summed into heavy atoms:
elementType: O O N N N N C C C C C C C C C C C C C C C
charge: -0.284829 -0.342368 -0.024998 -0.176273 -0.035656 -0.016230 0.323029 0.091404 0.087994 -0.009783 0.029901 0.060469 0.064797 -0.144312 0.132461 -0.171806 -0.042196 0.202097 0.022046 0.235582 -0.001328
polarizability: 2.84904426e+02 1.46744058e+01 2.38974211e+02 -1.08453729e+00 6.72321145e+00 1.19650701e+02
1716.lowfreq: -5.1678 -3.7393 -0.0008 -0.0005 0.0003 5.6446 23.6708 29.0187 35.4616
frequency: 23.6514 29.0020 35.4538 45.3954 56.6774 64.8339 76.3538 88.1222 98.5701 117.9970 128.3251 154.7141 182.6861 207.6499 216.5621 232.4761 246.7325 253.0052 265.3602 268.1671 278.6785 305.1321 318.2173 344.1543 388.2693 401.1865 437.8165 483.2494 546.9822 577.6934 590.9943 623.5502 631.6452 660.6027 687.3662 718.8060 720.6455 742.1157 778.5533 784.6125 797.5647 799.0767 813.6436 823.3055 834.9736 838.0066 859.9253 940.5565 942.9309 958.2551 960.5459 984.6021 995.6303 1026.0081 1039.8555 1067.3884 1091.3196 1112.3793 1114.4130 1121.1694 1129.1641 1135.5990 1162.0779 1178.5563 1218.3928 1225.0004 1237.4319 1247.5727 1257.8560 1270.5724 1293.9674 1297.9143 1310.9168 1320.4561 1336.8227 1344.6823 1359.7596 1363.8175 1365.2441 1386.5345 1391.6116 1398.5335 1401.2522 1404.5773 1437.6784 1453.9477 1463.2460 1463.5224 1467.7491 1469.0245 1474.0988 1474.8550 1477.9723 1484.3559 1486.2925 1487.0589 1488.1484 1496.1786 1552.1884 1582.8078 1618.0532 2948.3426 2971.2668 2974.6672 2978.9031 2992.7084 2995.7222 3002.4390 3009.7516 3016.2160 3019.9713 3043.7245 3067.9933 3071.4605 3076.9329 3080.7695 3092.2398 3092.5294 3107.5794 3108.8570 3166.7583 3234.4570 3267.6926
redmass: 3.7649 2.8437 2.7757 3.4724 1.7157 2.7502 4.0355 3.4559 4.8827 3.0885 3.3473 4.2796 1.6603 4.0237 1.5544 1.6012 1.2522 2.1420 3.2484 2.6620 3.7976 3.6272 5.4697 5.3994 3.8193 4.0793 4.3597 4.0607 4.6861 4.1623 5.0315 6.2583 5.7048 8.0619 4.7258 5.8195 5.5508 1.1871 2.3015 2.2404 1.7750 1.1075 1.3298 2.0796 1.7220 3.0130 1.6727 4.6624 1.4239 1.4940 2.1778 2.1895 2.0290 2.4962 3.5443 3.6857 2.1054 2.2519 2.8562 2.8788 2.1699 1.4577 2.1481 2.4748 1.6955 1.2607 4.6660 1.1361 1.4000 2.3364 1.1948 1.3853 1.5757 2.1561 2.5463 1.3948 1.3628 1.5157 1.5291 1.2268 1.2141 2.9583 1.7975 2.1679 3.0623 2.7550 1.1077 1.0404 1.1102 1.3744 1.0631 1.0528 1.0435 1.1813 1.0604 1.1014 1.0877 3.1757 9.2352 3.0872 3.9999 1.0579 1.0589 1.0397 1.0640 1.0352 1.0359 1.0974 1.0580 1.0991 1.0608 1.1026 1.1067 1.1012 1.0992 1.1018 1.0985 1.0997 1.1026 1.1028 1.0918 1.0968 1.0805
irintensity: 0.1013 0.5525 0.0490 0.0572 0.6789 0.8103 0.5581 1.3162 1.2386 1.7700 0.6346 1.2076 0.6071 1.1297 2.1916 2.1293 0.2582 0.2838 1.1836 0.0205 0.6793 14.7776 11.5702 4.5062 2.8282 21.3713 0.3170 2.1956 0.9001 5.9502 4.5855 6.0354 4.3686 0.3305 5.2944 13.5520 0.9758 10.3594 2.6466 13.9783 4.1372 3.7880 86.4163 7.2161 22.7868 4.0331 4.4987 78.7412 8.0378 7.6093 6.9487 1.7834 3.4676 69.2885 30.9469 49.0301 29.4205 12.6000 13.8903 173.9957 114.8442 5.3173 63.1900 20.8362 6.8842 5.3619 26.7976 0.0796 71.9765 326.2996 1.5822 48.6076 8.2085 12.2820 91.3982 45.4770 1.7022 34.7318 4.0433 18.4827 11.8870 15.6744 24.9252 20.6926 213.9213 6.8756 10.8959 12.0734 10.1995 13.7170 6.2579 6.6030 11.9703 69.5613 12.3525 15.3035 23.4766 12.0593 38.9192 470.5729 429.0515 33.6261 5.9003 35.1251 48.5724 29.6811 23.7373 53.4165 23.7782 0.5381 31.4043 27.1881 8.6650 80.3542 42.6532 0.8562 36.5483 43.6596 43.8690 20.5115 1.6656 4.6453 172.3236
temp: 298.150 k
press: 1.00000 atm
elementType: 8 8 7 7 7 7 6 6 6 6 6 6 6 6 6 6 6 6 6 6 6 1 1 1 1 1 1 1 1 1 1 1 1 1 1 1 1 1 1 1 1 1 1
symmnumber: 1
zpe: 937094.9 jmol-1
zpe.correction: 0.356921 hartree
zpe.thermalcorrener: 0.378875 hartree
zpe.thermalcorrenthalpy: 0.379819 hartree
zpe.thermalcorrgfe: 0.303382 hartree
zpe.sumelectzpe: -952.678734 hartree
zpe.sumelectthermal: -952.656780 hartree
zpe.sumelectthermalent: -952.655835 hartree
zpe.sumelectthermalfe: -952.732272 hartree
dipole: 2.2235 -0.5529 0.1837
dipole: 2.2986
quadrupole: -119.4524 -113.5240 -126.6010
quadrupole: 0.2909 -0.8860 0.7969
quadrupole: 0.4067 6.3351 -6.7419 0.2909 -0.8860 0.7969
hfenergy: -953.0356548 hartree
pointgroup: C01 [X(C15H22N4O2)]
dipole: -0.8592254 -0.2737687 -0.0677454 debye
polarizability: 286.6064396|-11.5478661|237.4291864|-2.6008441|-4.6944288|119.4937118 unknown
InChI: InChI=1S/C15H22N4O2/c1-4-7-8-16-13-11-10-18-19(5-2)14(11)17-9-12(13)15(20)21-6-3/h9-10,16H,4-8H2,1-3H3
charge 0 multiplicity 1
43 atoms
O  -1.991373 2.901773 -0.093537
O  -2.83975 0.741894 0.047292
N  -1.094005 -1.265196 0.163734
N  3.49585 -0.094184 0.016373
N  3.45631 -1.491119 0.097755
N  1.948003 1.793965 -0.074384
C  -0.10503 -0.328518 0.085048
C  1.299999 -0.640762 0.078751
C  -0.901229 -2.720099 0.248966
C  -2.258288 -3.447231 0.325673
C  2.226927 0.453628 -0.000807
C  -0.426682 1.08774 0.002401
C  -3.13247 -3.30093 -0.943478
C  2.134643 -1.812463 0.13688
C  4.7788 0.616191 -0.069557
C  0.623523 2.06223 -0.070047
C  -4.442332 -4.111692 -0.846473
C  -1.826967 1.519722 -0.009573
C  5.489687 0.378374 -1.4159
C  -3.400527 3.396418 -0.111108
C  -3.325784 4.916708 -0.209212
H  -0.337702 -3.079273 -0.637614
H  -0.296514 -2.965196 1.14616
H  -2.056793 -4.522104 0.502752
H  -2.820586 -3.083211 1.209723
H  -2.054603 -0.873907 0.158997
H  -2.549487 -3.637446 -1.824754
H  -3.375343 -2.234652 -1.119678
H  1.863673 -2.862862 0.206253
H  4.544663 1.68485 0.072906
H  5.413864 0.276728 0.76794
H  0.341104 3.117006 -0.127643
H  -4.23447 -5.189885 -0.710244
H  -5.052787 -3.997648 -1.760384
H  -5.054734 -3.776006 0.011549
H  5.676195 -0.698209 -1.568694
H  6.45906 0.908503 -1.427131
H  4.878728 0.753732 -2.255191
H  -3.902275 3.054544 0.812158
H  -3.920307 2.940182 -0.97296
H  -4.346589 5.34044 -0.224364
H  -2.785949 5.341516 0.654246
H  -2.806851 5.227552 -1.132021
