program: Gaussian 09
title: 000037063
version: EM64L-G09RevD.01
frameworkgroup: C1[X(C20H27NO6)]
method: RPBEPBE
basis: SDD
operation: Freq
keyword: #p
keyword: freq=noraman
keyword: PBEPBE/SDD
title: #p freq=noraman PBEPBE/SDD
converged: YES YES NO NO
title: Mulliken charges:
elementType: O O O O O O N C C C C C C C C C C C C C C C C C C C C H H H H H H H H H H H H H H H H H H H H H H H H H H H
charge: -0.277862 -0.240409 -0.240359 -0.277753 -0.262495 -0.262470 -0.327247 -0.499046 -0.498507 0.523115 0.522417 -0.638198 -0.546379 -0.545685 -0.637388 0.285125 0.244198 0.244212 0.284999 0.039828 0.039844 -0.533206 -0.536224 -0.536237 -0.533261 -0.519284 -0.519339 0.223154 0.195964 0.195867 0.223292 0.259884 0.248021 0.275183 0.274890 0.247974 0.242741 0.226809 0.213876 0.214984 0.220188 0.246086 0.220182 0.214987 0.246091 0.226686 0.214034 0.242737 0.228669 0.247019 0.211326 0.228643 0.211381 0.246946
chargesum: 0.00000
title: Mulliken charges with hydrogens summed into heavy atoms:
elementType: O O O O O O N C C C C C C C C C C C C C C C C C C C C
charge: -0.277862 -0.240409 -0.240359 -0.277753 -0.262495 -0.262470 -0.067363 -0.079928 -0.079348 0.523115 0.522417 -0.390177 -0.271196 -0.270795 -0.389414 0.285125 0.244198 0.244212 0.284999 0.039828 0.039844 0.150220 0.145034 0.145023 0.150195 0.167730 0.167630
polarizability: 3.33349840e+02 -1.75249806e-01 2.99082977e+02 -2.10448393e-01 1.20095995e+00 1.56542477e+02
1716.lowfreq: -4.2325 -0.0005 0.0005 0.0007 3.2605 5.0316 9.9552 12.1104 20.2179
frequency: 9.5760 11.7726 20.1850 44.1029 59.2104 60.0723 73.6880 77.3979 80.4969 100.0916 103.4411 104.2294 120.8534 126.9916 139.6673 155.4690 156.5722 184.5013 186.6070 193.6367 196.2104 197.3297 201.8088 223.4343 229.1075 237.3270 247.1605 259.2063 273.4901 284.5813 284.6968 301.1319 322.1679 350.6887 351.5213 365.3125 387.9131 423.3407 457.4613 474.3843 482.4109 516.4426 517.6372 560.5770 589.4460 589.7266 590.2439 617.7211 627.4727 651.3647 668.9979 714.9011 726.4539 740.2261 765.5327 767.8935 834.9283 836.8085 850.9141 863.1034 866.6585 868.8948 938.2195 953.5381 954.3586 956.5459 965.6407 986.0019 1007.6167 1018.7136 1081.9139 1086.5849 1090.1064 1109.5028 1109.7630 1110.3959 1110.4335 1112.9231 1113.9188 1125.6072 1138.7308 1146.1340 1152.3272 1153.5633 1156.4742 1156.9380 1159.0091 1160.6781 1182.6581 1203.2737 1204.4427 1223.1163 1223.6380 1253.3971 1300.5153 1312.2713 1316.5333 1362.9374 1386.5160 1392.1646 1408.5144 1413.2044 1422.7137 1423.1555 1442.1568 1443.0494 1444.1865 1447.5356 1447.7536 1456.8891 1457.1650 1463.8738 1465.0310 1466.9149 1466.9859 1467.5136 1470.4408 1472.2381 1474.0817 1474.3359 1479.5985 1479.7366 1486.4483 1490.7956 1493.0366 1594.1823 1595.6334 1597.6663 1599.5449 2856.4198 2863.0946 2954.4908 2954.6199 2956.4942 2957.1875 2962.0501 2962.3411 2970.6411 2970.8306 3040.8050 3040.8510 3044.5165 3044.7539 3071.6410 3071.9329 3119.0691 3119.2126 3121.3422 3121.7149 3122.5826 3122.6458 3147.1935 3147.2739 3167.5945 3168.1572 3441.9296
redmass: 4.3891 4.8682 5.1534 3.8978 3.1208 3.3511 3.5561 2.4747 2.4955 3.0076 3.4935 3.6416 3.3334 2.6883 3.6814 1.2622 1.2500 3.2337 2.9848 1.7206 2.4355 1.7980 2.2972 3.0378 2.9818 4.9209 1.5347 1.4419 2.6085 1.7736 1.8370 5.3824 4.6727 4.3582 4.3868 3.6504 4.6170 5.9366 5.1318 5.2917 5.9476 6.9769 6.8212 4.5738 3.6123 4.8120 4.7330 3.6998 3.9706 4.6148 4.0838 1.3259 5.2035 4.7837 2.9759 3.0808 1.7368 1.7226 1.4646 1.3906 6.8562 6.2288 6.2279 7.0427 8.8298 6.4236 1.6980 2.6621 5.7108 4.2363 2.2458 7.4215 6.7765 1.2458 1.2501 1.2606 1.2609 1.2629 1.2586 2.8594 2.4630 2.2017 1.3630 1.5002 1.4490 1.4636 1.4657 1.7172 1.0720 2.1997 2.1920 1.5179 1.4919 1.2861 1.5630 4.0282 4.3562 2.3953 6.6153 4.2673 2.0139 1.7447 1.2266 1.2187 1.2045 1.2169 1.2785 1.3462 1.4581 1.0798 1.0853 1.0533 1.0512 1.0572 1.0536 1.2596 1.2095 1.0565 1.0725 1.0789 1.0562 1.0552 1.2234 2.2750 1.9188 8.0653 7.7730 6.2704 6.3103 1.0707 1.0708 1.0333 1.0333 1.0333 1.0334 1.0870 1.0857 1.0324 1.0325 1.1035 1.1035 1.1031 1.1032 1.1010 1.1009 1.1028 1.1029 1.0995 1.0995 1.0989 1.0989 1.0903 1.0903 1.0902 1.0901 1.0748
irintensity: 0.0086 0.6985 0.5113 0.6307 9.9371 0.0614 4.8071 15.7663 0.3326 11.3932 0.7378 0.0011 7.4815 0.2669 0.0987 1.6369 1.5402 2.8112 2.9159 0.6987 0.9511 0.5408 9.4590 3.9236 1.0079 3.0957 0.0570 0.8104 1.2336 0.0182 0.0611 7.5847 1.8205 0.9969 0.3247 10.8773 0.0353 1.8118 19.9433 0.5978 2.8008 6.9503 0.7334 10.9873 15.6826 1.7752 2.4251 0.1088 21.9567 3.1507 1.6376 66.3827 21.7535 2.2706 19.8159 10.3448 4.7774 52.5836 13.5300 31.9504 2.2857 1.6367 39.1767 77.4957 3.6906 0.9797 7.2767 25.7230 3.6259 1.4334 4.9067 173.7029 436.1213 22.0450 10.1947 0.5304 0.2252 1.4221 0.1346 3.3780 49.4568 71.6270 11.6195 31.4486 29.9811 44.1528 5.7038 6.7493 3.7729 16.9920 113.8100 91.3570 53.3540 13.9939 7.7289 15.7897 172.5751 51.6516 7.8576 28.6775 45.1788 145.6740 27.1395 0.6315 4.6689 3.1307 19.6693 76.4811 96.6338 2.2890 1.0869 0.0054 24.2389 19.5356 20.4775 99.7621 15.4752 26.2569 95.4710 2.7423 21.3839 9.0606 24.7601 77.5182 15.5589 61.2424 163.9231 40.7245 28.3611 33.1103 161.4783 13.4228 141.3416 87.2142 38.4078 19.5984 43.7806 36.9119 125.8233 19.7979 80.2532 11.6759 86.0329 32.4239 38.0428 30.0593 20.2507 6.9405 48.2372 44.8251 10.9273 3.8643 15.3259 0.1811 4.8459 0.0546
temp: 298.150 k
press: 1.00000 atm
elementType: 8 8 8 8 8 8 7 6 6 6 6 6 6 6 6 6 6 6 6 6 6 6 6 6 6 6 6 1 1 1 1 1 1 1 1 1 1 1 1 1 1 1 1 1 1 1 1 1 1 1 1 1 1 1
symmnumber: 1
zpe: 1149061.4 jmol-1
zpe.correction: 0.437654 hartree
zpe.thermalcorrener: 0.467609 hartree
zpe.thermalcorrenthalpy: 0.468553 hartree
zpe.thermalcorrgfe: 0.373668 hartree
zpe.sumelectzpe: -1282.236631 hartree
zpe.sumelectthermal: -1282.206677 hartree
zpe.sumelectthermalent: -1282.205733 hartree
zpe.sumelectthermalfe: -1282.300618 hartree
dipole: 0.0013 -2.0130 1.4362
dipole: 2.4728
quadrupole: -201.0689 -123.0306 -157.1363
quadrupole: -0.1433 -0.0150 0.6963
quadrupole: -40.6570 37.3814 3.2756 -0.1433 -0.0150 0.6963
hfenergy: -1282.6742857 hartree
pointgroup: C01 [X(C20H27N1O6)]
dipole: -0.0009833 0.9591581 -0.1628961 debye
polarizability: 333.3487092|0.3685963|271.0061638|-0.4400123|56.7021293|184.6204207 unknown
InChI: InChI=1S/C20H27NO6/c1-22-15-7-13(8-16(23-2)19(15)26-5)11-21-12-14-9-17(24-3)20(27-6)18(10-14)25-4/h7-10,21H,11-12H2,1-6H3
charge 0 multiplicity 1
54 atoms
O  -3.732981 -2.389956 -0.829549
O  6.061077 1.651747 0.181278
O  -6.056609 1.651265 0.222619
O  3.722936 -2.377609 -0.883235
O  -6.062133 -0.857231 -0.766739
O  6.05526 -0.850969 -0.824034
N  0.003733 0.838003 0.917378
C  -1.236621 1.233428 1.616467
C  1.250212 1.23332 1.605512
C  -2.485007 0.692979 0.926753
C  2.492634 0.695044 0.903392
C  -3.666501 1.466432 0.903471
C  2.473769 -0.587426 0.312807
C  -2.472452 -0.593464 0.344687
C  3.675284 1.466704 0.877019
C  -3.647543 -1.11169 -0.246598
C  4.848536 0.95406 0.267271
C  -4.84473 0.951983 0.304875
C  3.643905 -1.103689 -0.290016
C  -4.850585 -0.348951 -0.276076
C  4.848168 -0.343137 -0.322054
C  -2.554585 -3.25189 -0.729763
C  6.125094 2.964779 0.823993
C  -6.11388 2.968553 0.857202
C  2.543276 -3.237754 -0.782806
C  -6.100151 -1.184652 -2.206609
C  6.083381 -1.165858 -2.266894
H  -1.171467 0.821543 2.646201
H  -1.339863 2.341229 1.734404
H  1.353668 2.341026 1.72426
H  1.195096 0.819785 2.635192
H  -0.000576 1.130698 -0.069403
H  -3.659235 2.467827 1.345355
H  1.539604 -1.153973 0.344793
H  -1.538979 -1.161324 0.373716
H  3.672771 2.465282 1.325292
H  -2.8521 -4.199922 -1.20211
H  -2.277727 -3.430192 0.327164
H  -1.68912 -2.820186 -1.27066
H  5.416526 3.680343 0.361258
H  5.921391 2.893718 1.91049
H  7.156825 3.310065 0.662174
H  -5.90298 2.904176 1.942743
H  -5.407141 3.679759 0.385052
H  -7.146049 3.314713 0.700108
H  2.27295 -3.424076 0.274431
H  1.675282 -2.799705 -1.314481
H  2.835613 -4.18253 -1.264804
H  -7.129637 -1.526464 -2.393838
H  -5.379602 -1.9857 -2.446561
H  -5.888578 -0.283387 -2.814071
H  7.110074 -1.510957 -2.463214
H  5.872608 -0.258242 -2.865098
H  5.357656 -1.961426 -2.509643
