program: Gaussian 09
title: 000036999
version: EM64L-G09RevD.01
frameworkgroup: C1[X(C20H24N2O)]
method: RPBEPBE
basis: SDD
operation: Freq
keyword: #p
keyword: freq=noraman
keyword: PBEPBE/SDD
title: #p freq=noraman PBEPBE/SDD
converged: YES YES NO NO
title: Mulliken charges:
elementType: O N N C C C C C C C C C C C C C C C C C C C C H H H H H H H H H H H H H H H H H H H H H H H H
charge: -0.229709 -0.220529 -0.082585 0.070516 0.296309 -0.430440 0.055095 0.253215 -0.728731 -0.355125 -0.568939 -0.428315 -0.338838 -0.258765 -0.227027 0.511224 -0.619111 -0.623029 -0.452489 -0.348698 -0.217732 -0.231338 -0.244634 0.227698 0.217237 0.241440 0.216415 0.228390 0.231278 0.181065 0.232231 0.265761 0.244489 0.255719 0.226347 0.225152 0.229132 0.183339 0.221144 0.218366 0.190186 0.232281 0.232281 0.235663 0.227234 0.227153 0.229673
chargesum: 0.00000
title: Mulliken charges with hydrogens summed into heavy atoms:
elementType: O N N C C C C C C C C C C C C C C C C C C C C
charge: -0.229709 -0.220529 -0.082585 0.070516 0.296309 0.014495 0.055095 0.253215 -0.042486 0.057219 -0.070948 -0.183826 -0.083119 -0.032417 -0.001874 0.511224 0.014503 0.017804 -0.220208 -0.113034 0.009502 -0.004185 -0.014960
polarizability: 2.60653242e+02 -1.20843164e+00 2.09028013e+02 -1.54630998e+01 8.91559555e+00 2.02937397e+02
1716.lowfreq: -20.4901 -7.0051 -0.0007 -0.0004 -0.0003 7.8122 8.7263 19.2598 27.8643
frequency: -18.8507 19.2080 27.6977 34.3582 43.9967 58.1807 87.6958 110.4138 128.1782 153.9091 169.5862 188.6738 211.5416 214.3324 221.1151 231.9616 239.3429 249.2796 274.1409 291.6369 327.6170 342.9482 360.7899 377.3674 403.3656 430.0309 448.7514 459.5860 478.6752 480.2825 545.2421 564.5823 586.9819 613.5244 621.5157 646.5541 692.9999 703.8614 719.5124 744.0424 754.5131 758.0455 767.3848 800.5415 815.8528 829.2099 853.2292 862.6895 864.8832 915.7651 935.7959 940.3905 976.8916 977.3905 990.0968 990.7719 997.1805 1012.3547 1017.5579 1024.3567 1026.7113 1032.2233 1037.3579 1071.5204 1078.5730 1085.6091 1091.0796 1104.1166 1112.2448 1132.7853 1154.2824 1164.6355 1172.6082 1172.9543 1186.8688 1192.6020 1209.0697 1241.5975 1249.7901 1265.1002 1273.6315 1300.3044 1303.2244 1318.7060 1331.7985 1334.2629 1363.0894 1373.3071 1386.0018 1388.9660 1408.0752 1417.7013 1439.8017 1443.1346 1449.7347 1451.1118 1459.9672 1460.7708 1464.4959 1470.1090 1474.0563 1474.5204 1477.9730 1484.3122 1485.0040 1485.5665 1595.6400 1600.0520 1615.6541 1620.5062 1646.4541 2818.1917 2843.3048 2861.2163 2978.5783 2983.4385 2993.7658 3018.4110 3020.3438 3032.1464 3032.3981 3059.9906 3078.4039 3085.9653 3090.5574 3091.4829 3111.5377 3123.0314 3125.9751 3134.8325 3136.8262 3145.5885 3155.1200 3163.5911 3168.5905
redmass: 2.5400 3.9005 4.3345 4.3322 4.6838 4.5569 2.7869 3.3026 3.4057 3.3826 4.3448 2.8018 1.3306 2.1060 1.7124 1.9679 1.7492 1.4794 3.7383 2.5547 3.7308 2.7824 3.2571 3.3379 2.8036 3.0888 2.5379 3.2674 5.7031 3.9735 5.2323 4.0444 3.9840 5.2215 4.6682 4.4203 5.7011 1.9777 3.2604 1.9177 3.4723 1.3063 2.4737 3.5058 3.5883 2.2104 1.2513 2.0513 1.5878 1.4621 1.4258 1.9140 1.3364 1.3651 3.8653 3.0113 1.4720 2.7701 2.2612 1.6263 2.0132 1.6529 2.8139 2.9127 1.9798 1.5489 1.5085 2.0834 1.9762 1.7248 1.9837 1.8226 1.0989 1.1530 1.1118 1.9650 2.8244 1.8414 2.3811 2.3929 1.4465 1.4406 1.3892 1.5360 3.1445 1.4832 1.8347 1.3025 1.3330 3.7171 3.9503 1.1463 1.1641 2.0783 1.0868 1.9191 1.0580 1.3241 1.0616 1.1522 1.1139 1.0552 1.0798 2.4208 1.0759 2.2038 6.2278 7.2794 6.1061 7.5623 9.9691 1.0688 1.0578 1.0574 1.0588 1.0344 1.0585 1.0713 1.0867 1.1008 1.0743 1.1033 1.1011 1.1006 1.1007 1.0998 1.0880 1.0859 1.0865 1.0908 1.0898 1.0959 1.0944 1.1014 1.0994
irintensity: 0.3987 0.0205 0.0533 0.3600 1.4437 0.1939 1.4328 1.3515 0.3244 2.1698 1.2277 1.4791 0.5209 0.3504 0.2123 1.4095 0.8835 0.7670 1.9774 3.4461 13.0798 4.4791 1.3545 0.8932 0.2579 3.2509 0.1126 7.5256 4.3693 10.3222 12.5891 1.3520 8.8060 6.7467 9.0775 9.8468 2.6187 41.5153 5.8270 39.1538 1.1383 84.5226 7.9363 10.9401 14.9999 8.1344 0.3067 2.6600 2.3963 3.1390 1.8677 6.9643 0.0892 0.2390 7.7381 11.1439 2.3593 24.8868 7.7714 5.7852 10.2154 16.9640 21.2331 8.6269 13.2175 17.4381 3.3665 4.9052 11.6392 7.3826 10.8301 33.6586 0.7797 1.4161 1.3346 60.1881 1.4849 2.7523 3.0977 6.7463 1.6737 7.7235 22.0008 2.8776 98.8752 23.6812 4.2982 12.2382 10.3616 1.7692 1.8740 3.3718 2.6084 10.1714 4.1155 20.4757 12.2074 41.8157 13.3815 8.0505 6.1790 13.0218 18.8387 43.6834 27.8951 62.7281 2.7074 52.7517 8.6800 115.9990 157.4344 112.1009 84.3078 178.7777 34.5788 24.2316 29.5127 43.2814 14.2769 10.3101 49.6722 19.5314 37.0080 21.2703 37.4235 24.3742 9.4529 0.8401 2.3501 9.4027 10.9176 33.0691 27.9274 25.1441 15.8842
temp: 298.150 k
press: 1.00000 atm
elementType: 8 7 7 6 6 6 6 6 6 6 6 6 6 6 6 6 6 6 6 6 6 6 6 1 1 1 1 1 1 1 1 1 1 1 1 1 1 1 1 1 1 1 1 1 1 1 1
symmnumber: 1
zpe: 1031308.6 jmol-1
zpe.correction: 0.392805 hartree
zpe.thermalcorrener: 0.414135 hartree
zpe.thermalcorrenthalpy: 0.415080 hartree
zpe.thermalcorrgfe: 0.341328 hartree
zpe.sumelectzpe: -959.578367 hartree
zpe.sumelectthermal: -959.557036 hartree
zpe.sumelectthermalent: -959.556092 hartree
zpe.sumelectthermalfe: -959.629844 hartree
dipole: 1.3427 -0.6943 -2.2242
dipole: 2.6892
quadrupole: -125.4210 -129.9505 -144.8292
quadrupole: -1.1936 -0.6206 -3.7092
quadrupole: 7.9792 3.4497 -11.4289 -1.1936 -0.6206 -3.7092
hfenergy: -959.9711714 hartree
pointgroup: C01 [X(C20H24N2O1)]
dipole: -0.2258738 0.5765454 -0.8578797 debye
polarizability: 242.1796462|-23.8515506|228.3819395|9.0174469|-16.1206402|202.057066 unknown
InChI: InChI=1S/C20H24N2O/c1-20(13-14-21(2)3)17-11-7-8-12-18(17)22(19(20)23)15-16-9-5-4-6-10-16/h4-12H,13-15H2,1-3H3
charge 0 multiplicity 1
47 atoms
O  0.32498 -0.74534 2.779725
N  -0.008933 0.902351 1.113415
N  1.269026 -3.618274 -0.980104
C  2.051268 -0.32367 0.987566
C  1.935483 0.701487 -0.136421
C  2.17912 -1.799115 0.498691
C  0.712749 -0.124442 1.752871
C  0.704675 1.4017 -0.011486
C  3.222375 0.002011 1.958166
C  1.050215 -2.252326 -0.448726
C  -1.29765 1.400257 1.608365
C  2.818147 1.024888 -1.176828
C  0.331497 2.423423 -0.90388
C  2.463675 2.054762 -2.089459
C  1.234956 2.741875 -1.949606
C  -2.46942 1.173938 0.654257
C  0.416902 -3.892345 -2.155934
C  1.12867 -4.673316 0.04606
C  -3.440727 2.187464 0.467997
C  -2.625934 -0.061233 -0.022309
C  -4.55548 1.970241 -0.374143
C  -3.735199 -0.278937 -0.86739
C  -4.705394 0.735596 -1.045673
H  2.205922 -2.436554 1.402141
H  3.145603 -1.919789 -0.027044
H  3.169318 -0.657692 2.84233
H  4.191195 -0.15714 1.451402
H  3.180029 1.050942 2.300528
H  1.008471 -1.560574 -1.310865
H  0.064348 -2.177263 0.084841
H  -1.209952 2.47811 1.847946
H  -1.468874 0.856737 2.558377
H  3.769414 0.491903 -1.288131
H  -0.626401 2.9442 -0.813382
H  3.143485 2.317149 -2.907082
H  0.971184 3.531026 -2.6626
H  0.606095 -3.136422 -2.938629
H  -0.679659 -3.882768 -1.923029
H  0.665439 -4.885666 -2.571124
H  1.340326 -5.657615 -0.408457
H  0.103629 -4.709716 0.496538
H  1.853316 -4.518061 0.862397
H  -3.328031 3.149394 0.984815
H  -1.87678 -0.850123 0.11407
H  -5.300507 2.762493 -0.509097
H  -3.845089 -1.238089 -1.38602
H  -5.56648 0.566222 -1.701679
