program: Gaussian 09
title: 000036988
version: EM64L-G09RevD.01
frameworkgroup: C1[X(C8H18O4S4)]
method: RPBEPBE
basis: SDD
operation: Freq
keyword: #p
keyword: freq=noraman
keyword: PBEPBE/SDD
title: #p freq=noraman PBEPBE/SDD
converged: YES YES NO NO
title: Mulliken charges:
elementType: S S S S O O O O C C C C C C C C H H H H H H H H H H H H H H H H H H
charge: 0.031854 0.032150 0.761652 0.761634 -0.605523 -0.605429 -0.570250 -0.570379 -0.277514 -0.277346 -0.325034 -0.325447 -0.720363 -0.720430 -0.668776 -0.668645 0.220178 0.224040 0.224115 0.220511 0.249061 0.203449 0.249214 0.203268 0.265411 0.274583 0.265161 0.274560 0.314722 0.264295 0.314849 0.264328 0.358086 0.358014
chargesum: 0.00000
title: Mulliken charges with hydrogens summed into heavy atoms:
elementType: S S S S O O O O C C C C C C C C
charge: 0.031854 0.032150 0.761652 0.761634 -0.247436 -0.247415 -0.570250 -0.570379 0.166704 0.167280 0.127476 0.127035 -0.180370 -0.180709 -0.089758 -0.089468
polarizability: 2.71172819e+02 5.21071972e-02 1.47672956e+02 -8.25670276e+00 1.29619676e-01 1.55519064e+02
1716.lowfreq: -1.3915 -0.0029 -0.0025 0.0021 4.8442 7.9595 11.5298 13.4086 19.5610
frequency: 11.1808 13.0164 19.2916 31.1303 35.8656 42.8635 46.8082 74.3100 87.9783 95.1817 116.8657 121.4584 124.0028 159.6176 174.1733 198.3425 204.2417 216.8223 233.4061 263.7961 265.6448 307.9500 308.5466 321.6599 327.5137 350.2085 350.6601 410.9653 413.9761 415.8346 519.0288 519.5478 605.8166 606.5851 667.7972 671.2381 742.0841 743.1560 768.5715 769.1200 860.6480 861.2348 883.5294 884.5351 1015.0372 1015.1966 1027.4972 1027.6905 1031.5882 1034.4740 1043.8565 1044.0069 1081.3590 1082.2278 1090.7425 1092.6076 1205.2930 1208.2922 1224.0329 1224.8989 1243.7373 1249.8869 1286.6460 1287.9578 1298.3223 1298.9418 1312.9203 1317.4575 1349.6044 1350.5618 1425.1200 1426.0890 1427.4188 1429.2396 1468.3182 1468.5544 1483.1174 1483.3981 2977.1519 2977.7782 2990.6737 2990.9991 3005.0770 3005.6003 3029.8663 3030.5136 3036.8996 3037.0732 3054.0036 3054.4887 3084.5120 3085.0081 3125.9086 3125.9357 3505.5399 3505.7536
redmass: 7.0847 10.4866 7.8653 6.6515 4.7005 5.9052 3.4512 6.4188 5.1306 2.5126 2.3128 2.0348 2.1180 2.4846 6.9692 5.6435 5.5488 5.9698 3.5647 4.9685 5.0396 1.3126 1.3114 4.6168 5.2376 4.5565 4.5394 5.2310 5.4293 17.2066 14.3223 14.3379 5.3116 5.2942 5.0305 5.2339 1.0924 1.0949 1.2010 1.2054 3.0640 3.2225 2.0596 1.9851 1.5918 1.5676 3.1420 3.2674 1.4425 1.4364 2.2214 2.2088 2.7446 2.7659 1.0712 1.0746 1.1708 1.1719 1.3781 1.3801 1.2092 1.2070 1.1517 1.1526 1.0679 1.0685 1.2848 1.2813 1.4319 1.4340 1.1008 1.1019 1.0929 1.0918 1.0740 1.0742 1.0950 1.0952 1.0589 1.0590 1.0595 1.0595 1.0580 1.0584 1.1007 1.1004 1.0570 1.0573 1.1036 1.1035 1.1065 1.1058 1.1090 1.1090 1.0668 1.0668
irintensity: 2.3286 0.4295 3.5502 0.5632 3.6514 0.1106 3.6705 3.3216 0.1579 0.0150 1.3729 0.6448 1.5907 0.0060 0.3427 3.6036 8.0845 0.0057 12.8939 12.1048 0.0639 169.6192 90.5632 32.9178 6.7584 33.0120 6.1722 4.5791 4.6515 0.0112 80.0764 50.5454 1.4298 2.5723 1.4047 2.9207 18.2510 6.0908 2.0218 1.2075 29.5727 28.9539 8.5620 31.9470 30.1912 55.4233 27.4017 12.3622 3.9506 1.3776 3.7434 22.4896 0.3639 4.6403 0.7451 4.3575 9.0917 1.7769 0.0013 0.0022 2.3446 0.4117 2.5617 0.0745 1.4656 1.9355 68.9227 4.1169 2.8396 0.4541 7.9339 7.5069 4.3090 2.4426 1.6209 1.3879 15.6001 17.8464 7.6253 7.5485 11.8482 10.9768 32.4415 14.9510 2.6631 3.2360 6.3387 5.6883 7.7118 19.1932 23.0743 17.2639 6.1016 7.0058 26.7513 24.7298
temp: 298.150 k
press: 1.00000 atm
elementType: 16 16 16 16 8 8 8 8 6 6 6 6 6 6 6 6 1 1 1 1 1 1 1 1 1 1 1 1 1 1 1 1 1 1
symmnumber: 1
zpe: 679030.8 jmol-1
zpe.correction: 0.258629 hartree
zpe.thermalcorrener: 0.281722 hartree
zpe.thermalcorrenthalpy: 0.282667 hartree
zpe.thermalcorrgfe: 0.199393 hartree
zpe.sumelectzpe: -2207.286634 hartree
zpe.sumelectthermal: -2207.263541 hartree
zpe.sumelectthermalent: -2207.262597 hartree
zpe.sumelectthermalfe: -2207.345870 hartree
dipole: 0.0513 -1.4628 0.0282
dipole: 1.4640
quadrupole: -126.3377 -137.9294 -131.8144
quadrupole: 0.7283 32.3969 0.0655
quadrupole: 5.6895 -5.9022 0.2127 0.7283 32.3969 0.0655
hfenergy: -2207.5452633 hartree
pointgroup: C01 [X(C8H18O4S4)]
dipole: -0.0200953 -0.0306887 -0.5747958 debye
polarizability: 271.2411926|7.7390992|155.4284726|-0.6079238|-0.4351363|147.6951736 unknown
InChI: InChI=1S/C8H18O4S4/c9-15(10)7-3-1-5-13-14-6-2-4-8-16(11)12/h9,11H,1-8H2
charge 0 multiplicity 1
34 atoms
S  -0.343959 -0.972719 1.651296
S  0.3506 1.184464 1.524797
S  -6.726677 0.275526 -1.177976
S  6.72595 -0.421906 -1.138457
O  -7.939148 0.562928 0.25607
O  7.926184 -0.59311 0.324522
O  -6.623041 -1.328577 -1.498738
O  6.652666 1.145873 -1.610946
C  -2.953228 -0.164025 0.756605
C  2.954185 0.264407 0.724619
C  -4.035521 -0.178563 -0.35521
C  4.036562 0.148774 -0.380989
C  -1.713071 -0.963764 0.333671
C  1.719155 1.021051 0.216116
C  -5.28279 0.588828 0.082851
C  5.272087 -0.586152 0.13861
H  -3.366566 -0.593518 1.689261
H  -2.649868 0.876784 0.982734
H  2.643403 -0.742951 1.063752
H  3.370755 0.791298 1.604382
H  -4.32669 -1.222711 -0.585734
H  -3.617345 0.257705 -1.284074
H  4.342502 1.159023 -0.718219
H  3.613454 -0.376885 -1.259987
H  -1.272444 -0.578518 -0.601901
H  -1.944633 -2.037195 0.195417
H  1.275027 0.53856 -0.67153
H  1.957606 2.071238 -0.039464
H  -5.710786 0.227505 1.03255
H  -5.163882 1.684253 0.108655
H  5.701956 -0.135953 1.048738
H  5.137896 -1.671532 0.27539
H  -8.860625 0.505053 -0.124747
H  8.850485 -0.587391 -0.053766
