program: Gaussian 09
title: 000036971
version: EM64L-G09RevD.01
frameworkgroup: C1[X(C11H15ClO2)]
method: RPBEPBE
basis: SDD
operation: Freq
keyword: #p
keyword: freq=noraman
keyword: PBEPBE/SDD
title: #p freq=noraman PBEPBE/SDD
converged: NO YES NO NO
title: Mulliken charges:
elementType: Cl O O C C C C C C C C C C C H H H H H H H H H H H H H H H
charge: -0.079573 -0.430367 -0.213584 0.292798 -0.117661 -0.113757 -0.113755 -0.512181 -0.509921 -0.509902 -0.428557 -0.428557 -0.442492 0.082377 0.215266 0.215268 0.251421 0.251475 0.211201 0.238057 0.237984 0.211230 0.226093 0.225530 0.225539 0.226097 0.204757 0.203711 0.381500
chargesum: 0.00000
title: Mulliken charges with hydrogens summed into heavy atoms:
elementType: Cl O O C C C C C C C C C C C
charge: -0.079573 -0.048867 -0.213584 0.292798 -0.117661 0.101510 0.101513 -0.009286 -0.060663 -0.060688 0.023067 0.023079 -0.034024 0.082377
polarizability: 1.38644064e+02 6.58196147e+00 1.25912721e+02 -3.87345258e-03 -4.57032617e-03 1.01846933e+02
1716.lowfreq: -15.4258 -12.7740 -0.0009 0.0006 0.0014 23.0432 39.2159 130.8869 152.6036
frequency: 39.1470 130.8788 152.6018 194.3004 200.1629 297.6565 310.0906 316.6421 325.1865 337.3027 388.4747 391.8263 428.8173 437.7209 462.5922 500.7129 582.9851 601.5526 641.3110 673.3978 709.1738 715.3993 778.3942 816.8349 830.5838 872.1003 878.3483 879.7218 883.6086 943.6714 961.9091 962.7693 977.2425 990.1529 1014.5847 1040.6556 1048.6393 1050.7273 1100.2644 1103.7350 1103.8965 1110.2666 1157.4529 1168.7172 1220.0414 1247.2933 1267.5130 1276.4325 1277.7193 1282.9618 1285.9687 1291.5097 1312.0860 1315.3627 1321.7797 1338.8385 1342.4941 1345.8515 1354.5213 1451.6466 1453.3607 1464.4386 1465.1744 1467.2788 1487.3089 1646.7168 2976.7444 2986.1858 2988.2136 2995.5692 2998.7177 3010.7344 3015.6977 3020.1368 3036.1532 3055.9751 3060.8739 3061.5367 3066.8401 3082.9077 3515.3499
redmass: 11.3948 9.6821 3.9705 3.8064 3.5305 6.1716 2.1293 6.4757 3.9532 2.3193 4.0831 4.6484 1.7559 1.8735 1.8003 3.8541 1.2221 3.8746 3.9546 4.5230 4.8776 4.6450 3.8715 3.1116 2.7826 2.8431 1.5680 1.8676 1.5931 2.2253 2.3731 2.2160 2.1270 2.9479 3.4343 1.8649 1.9172 1.7499 1.7854 1.7682 1.0995 1.0718 1.5643 1.0696 2.3145 1.7237 1.7448 1.8827 1.7287 1.3971 1.7222 1.9357 1.7652 1.4391 1.8082 1.4559 1.4225 1.6154 1.5432 1.0822 1.0825 1.0905 1.0879 1.0910 1.0908 9.1596 1.0622 1.0633 1.0639 1.0642 1.0637 1.0791 1.0708 1.0703 1.1030 1.1017 1.1039 1.1008 1.1035 1.1036 1.0640
irintensity: 0.3916 0.1586 0.0390 0.8602 1.2709 0.5069 0.1143 14.3498 7.3754 1.0606 0.5804 0.3555 0.1499 1.0143 6.9083 21.6101 110.8239 40.6880 0.0002 18.6321 33.8409 23.9444 4.2944 12.4205 0.5272 16.4986 0.2472 3.7234 0.0611 0.8158 32.0157 2.6721 3.6276 39.8437 60.5284 0.1255 4.2190 0.1642 121.4988 49.0330 2.3871 1.5844 17.8286 0.0073 0.8577 3.7747 0.2512 46.3454 0.0398 0.5966 1.0780 12.6066 3.0196 1.0631 12.9018 3.1474 9.1708 1.0477 0.1934 0.6835 0.0486 19.9657 21.0688 26.4107 0.0971 225.9066 24.5597 16.3935 25.5245 0.3001 31.0352 125.8508 48.9754 5.9192 26.1271 0.2348 9.4744 42.6267 45.8882 20.2422 25.1025
temp: 298.150 k
press: 1.00000 atm
elementType: 17 8 8 6 6 6 6 6 6 6 6 6 6 6 1 1 1 1 1 1 1 1 1 1 1 1 1 1 1
symmnumber: 1
zpe: 635816.1 jmol-1
zpe.correction: 0.242170 hartree
zpe.thermalcorrener: 0.253924 hartree
zpe.thermalcorrenthalpy: 0.254868 hartree
zpe.thermalcorrgfe: 0.204598 hartree
zpe.sumelectzpe: -1037.642407 hartree
zpe.sumelectthermal: -1037.630652 hartree
zpe.sumelectthermalent: -1037.629708 hartree
zpe.sumelectthermalfe: -1037.679978 hartree
dipole: 1.9779 3.8312 -0.0004
dipole: 4.3117
quadrupole: -91.5122 -97.7975 -86.3646
quadrupole: -3.1381 -0.0058 0.0062
quadrupole: 0.3792 -5.9060 5.5268 -3.1381 -0.0058 0.0062
hfenergy: -1037.8845764 hartree
pointgroup: C01 [X(C11H15Cl1O2)]
dipole: 0.3697163 1.6555556 0.0004753 debye
polarizability: 134.5879673|8.8605796|129.9688163|-0.0047086|0.0046231|101.8469339 unknown
InChI: InChI=1S/C11H15ClO2/c12-11-4-7-1-8(5-11)3-10(2-7,6-11)9(13)14/h7-8,13H,1-6H2
charge 0 multiplicity 1
29 atoms
Cl -2.572359 -2.416226 -0.001066
O  3.250944 0.627209 -0.001722
O  2.818959 -1.648372 -0.000175
C  0.918837 -0.044038 -0.000216
C  -1.460952 -0.84063 -0.000299
C  -0.87868 1.240096 -1.265528
C  -0.878286 1.238513 1.267343
C  0.005063 -1.307531 -0.000815
C  0.614537 0.817785 -1.272422
C  0.614938 0.816201 1.273227
C  -1.782827 -0.029175 -1.267521
C  -1.782422 -0.030772 1.268031
C  -1.176254 2.086808 0.001479
C  2.378393 -0.477299 -0.000475
H  -1.090481 1.834527 -2.174915
H  -1.089781 1.831814 2.17754
H  0.211857 -1.92884 -0.889712
H  0.212181 -1.929893 0.887261
H  0.837968 0.227541 -2.182654
H  1.269574 1.707509 -1.281848
H  1.269978 1.705921 1.283535
H  0.838665 0.224782 2.182623
H  -2.851233 0.254455 -1.273652
H  -1.591933 -0.642701 -2.167244
H  -1.591229 -0.645408 2.16693
H  -2.850823 0.252856 1.274863
H  -0.552897 3.002362 0.00194
H  -2.235837 2.409321 0.001852
H  4.189101 0.293885 -0.001962
