program: Gaussian 09
title: 000036967
version: EM64L-G09RevD.01
frameworkgroup: C1[X(C9H8Cl2F4O3)]
method: RPBEPBE
basis: SDD
operation: Freq
keyword: #p
keyword: freq=noraman
keyword: PBEPBE/SDD
title: #p freq=noraman PBEPBE/SDD
converged: YES YES NO NO
title: Mulliken charges:
elementType: Cl Cl F F F F O O O C C C C C C C C C H H H H H H H H
charge: 0.048490 0.042141 -0.098504 -0.121665 -0.138649 -0.090532 -0.413799 -0.476322 -0.257805 0.265770 -0.521959 -0.250556 -0.024314 0.045041 0.394216 -0.424530 -0.246489 -0.163249 0.276229 0.277856 0.315780 0.389150 0.375449 0.269997 0.261742 0.266512
chargesum: 0.00000
title: Mulliken charges with hydrogens summed into heavy atoms:
elementType: Cl Cl F F F F O O O C C C C C C C C C
charge: 0.048490 0.042141 -0.098504 -0.121665 -0.138649 -0.090532 -0.024649 -0.100873 -0.257805 0.265770 0.032126 0.065224 -0.024314 0.045041 0.394216 -0.154533 0.015253 0.103264
polarizability: 1.44210615e+02 -1.12922397e+00 1.21267878e+02 -9.69533921e+00 2.21692812e+00 1.05137493e+02
1716.lowfreq: -7.6253 -3.7215 0.0018 0.0022 0.0022 8.0542 22.3549 38.2384 44.6608
frequency: 21.8840 38.1972 44.5917 49.0792 65.9913 82.5391 133.1590 162.8518 179.5404 197.8326 225.2099 250.0185 266.4186 271.1886 292.9999 305.4623 321.3940 347.2238 373.2773 376.8925 378.1704 393.5471 417.7919 458.4786 516.7077 536.0647 563.5739 592.2329 624.3327 682.0953 715.1415 741.8384 755.0638 805.5659 818.8525 832.3980 854.5376 870.3890 882.1383 889.0859 910.6978 946.3100 986.1406 1007.9636 1012.8971 1026.5110 1041.0774 1055.5471 1092.3177 1115.6689 1128.6891 1133.8843 1170.7613 1211.3321 1232.3789 1277.9979 1285.8981 1344.2402 1361.1530 1386.8306 1444.1373 1466.6948 1487.8330 1599.2251 3025.4837 3059.9647 3084.8135 3115.7239 3223.3649 3237.3751 3270.3517 3565.9304
redmass: 5.3423 9.4961 14.9312 8.0228 6.6089 8.7272 15.1469 7.6716 8.0745 16.8237 6.6417 8.9176 16.4949 10.0665 13.2998 5.2999 3.7300 10.6204 6.2316 13.3407 1.6865 4.3727 6.2350 7.0162 3.2170 8.1909 12.3681 3.0038 6.7338 5.0796 5.0774 1.2678 2.9319 4.3888 2.3981 1.3255 2.5271 6.4240 3.8709 1.3990 3.4540 6.5313 8.2088 3.5609 1.8377 6.7143 2.4536 4.8628 7.3675 3.7207 6.0326 1.5463 1.6600 1.4964 3.3194 1.4211 1.2555 1.2179 1.8551 1.5287 1.1004 1.2377 4.3197 6.8096 1.0608 1.0700 1.1005 1.0882 1.0933 1.0985 1.1088 1.0664
irintensity: 0.5563 0.2472 0.0255 1.3867 2.5256 0.0543 0.6441 1.2412 2.1228 2.8820 2.4480 3.2030 1.0640 1.8245 2.1677 13.7098 5.2430 3.0691 13.6406 2.9106 41.1913 46.4595 45.8111 8.6755 19.8098 17.9526 9.9169 7.0288 22.8935 30.5330 81.6415 74.4170 66.6263 33.6458 51.9293 17.2151 179.3524 14.3671 68.0819 4.5614 130.7029 126.7414 123.5338 51.0138 13.3414 98.9492 1.6147 35.5829 232.4345 42.2068 125.3788 23.6548 19.3940 12.8761 40.2570 14.6619 11.7781 19.0769 1.6178 35.7624 7.2282 124.4964 7.8716 1.1844 1.5559 753.3859 1.0732 2.9649 1.9771 0.2908 0.0378 21.3214
temp: 298.150 k
press: 1.00000 atm
elementType: 17 17 9 9 9 9 8 8 8 6 6 6 6 6 6 6 6 6 1 1 1 1 1 1 1 1
symmnumber: 1
zpe: 428520.0 jmol-1
zpe.correction: 0.163215 hartree
zpe.thermalcorrener: 0.181195 hartree
zpe.thermalcorrenthalpy: 0.182139 hartree
zpe.thermalcorrgfe: 0.115168 hartree
zpe.sumelectzpe: -1891.495180 hartree
zpe.sumelectthermal: -1891.477200 hartree
zpe.sumelectthermalent: -1891.476255 hartree
zpe.sumelectthermalfe: -1891.543227 hartree
dipole: 7.2147 0.5238 -1.4302
dipole: 7.3737
quadrupole: -107.1549 -114.3481 -122.5715
quadrupole: -0.1356 -1.0949 0.8585
quadrupole: 7.5366 0.3434 -7.8800 -0.1356 -1.0949 0.8585
hfenergy: -1891.6583945 hartree
pointgroup: C01 [X(C9H8Cl2F4O3)]
dipole: -2.8565029 0.4222114 0.2796349 debye
dipolederiv: -0.2064221 0.0412007 -0.0760547 0.0394503 -0.5018408 0.3033479 -0.0657176 0.2769019 -0.3451776 -0.1785982 0.0260685 -0.0739193 0.0383204 -0.1562908 0.0265952 -0.1359802 -0.0234873 -0.7324198 -0.9188624 0.1628712 -0.0287074 0.0011397 -0.3594523 0.0547543 -0.0324176 0.0175075 -0.2405374 -0.341008 -0.061976 0.0468812 -0.0231648 -0.3875772 -0.1858584 0.0562978 -0.0672231 -0.7670216 -0.6070192 -0.1699095 -0.1544135 -0.2839254 -0.6696327 -0.0844841 -0.1249295 -0.0150325 -0.3645572 -0.7120264 0.171889 0.2252018 0.2814794 -0.3568913 -0.0641086 0.1416598 -0.0245223 -0.4121374 -0.700685 -0.0466048 -0.1608408 -0.0408159 -0.4892933 0.0058315 -0.254256 -0.0483223 -0.7950092 -1.0132991 -0.0853964 -0.0900634 -0.1931992 -0.2435195 0.1293507 0.1596483 0.0450711 -0.8176297 -0.5235263 -0.1767488 0.1008465 -0.1725862 -0.5283331 0.0407957 0.0985211 0.05239 -0.1330873 0.1510078 0.1471551 0.0810887 -0.0871219 0.2029591 -0.1386868 0.0922407 0.2248949 0.3584688 -0.1421667 -0.0039886 0.0086295 -0.0631647 -0.050482 -0.0361857 0.0367634 -0.0287685 -0.1611435 0.7731782 0.0490538 -0.0270918 0.1147445 0.2130839 -0.1200215 -0.1793065 -0.0472249 0.7167795 1.3108405 -0.1724207 0.0385084 0.0262758 1.2192289 -0.2447036 0.023014 -0.2784057 1.2989671 1.3454951 -0.1230557 -0.0076415 -0.0040543 1.0981682 0.2789038 0.1647596 -0.060849 1.5692078 -0.0987364 0.0860121 0.0377488 0.0532288 0.3203969 0.0214605 -0.11072 -0.0011186 -0.1337017 -0.0279672 -0.0939585 -0.0626341 -0.0158077 0.0107464 0.0201657 -0.0229261 0.0368088 -0.1456516 -0.0384731 0.0078622 -0.0652561 0.029283 -0.132452 -0.0154744 -0.0481612 -0.0024312 -0.167252 0.1792913 0.119127 -0.0891659 0.1546204 0.1961866 -0.0336432 -0.0990359 -0.0256166 -0.0948223 0.0923522 -0.0236034 0.0046447 -0.0280889 0.0955559 0.0255134 0.047477 0.0189534 -0.0338638 0.0854399 0.051431 -0.0323439 0.0398985 -0.0250603 0.0085454 -0.0270665 0.0284818 0.0892875 0.1194857 -0.0069474 0.0256889 -0.0188005 -0.0089429 0.0131746 0.0169204 -0.0104076 0.0478998 0.8882208 -0.0001846 0.1262152 -0.0247891 0.2527983 0.0401713 0.0972261 0.0182668 0.3644887 0.3325943 0.0801844 0.0456343 0.1452457 0.1357411 -0.0211319 0.0320644 -0.0655603 0.3409772 0.143171 0.0311047 0.0202029 0.0260578 0.0014138 -0.0154069 0.0164259 -0.017031 0.1800625 -0.0062526 -0.021275 0.0664957 -0.026523 0.1273237 0.0066837 0.0689037 0.0078592 0.1795535 0.0939658 0.0121098 0.040346 0.0322971 0.0361654 -0.0155886 0.0485952 -0.0111345 0.1983197 unknown
polarizability: 144.983498|-2.9262927|115.9540032|-7.5554415|-8.0826913|109.6784842 unknown
InChI: InChI=1S/C9H8Cl2F4O3/c10-8(12,13)7(17,9(11,14)15)4-5(16)6-2-1-3-18-6/h1-3,5,16-17H,4H2
charge 0 multiplicity 1
26 atoms
Cl 1.879507 2.679197 -1.125117
Cl 2.133126 -1.08126 2.356066
F  3.645423 1.032864 -0.006255
F  2.035415 1.815502 1.379303
F  1.026891 -2.312056 0.283457
F  3.169111 -1.664583 -0.022389
O  1.524732 -0.266745 -1.625679
O  -1.016747 0.023343 -2.039275
O  -2.913302 1.186242 0.079704
C  1.385692 0.03847 -0.227318
C  -0.077293 0.332492 0.240937
C  -1.152598 -0.405338 -0.597124
C  2.272415 1.302957 0.075824
C  1.945512 -1.244423 0.499781
C  -2.536085 -0.171479 -0.097348
C  -3.604325 -0.988474 0.227934
C  -4.697772 -0.128473 0.63212
C  -4.247551 1.175176 0.524506
H  -0.187567 0.059392 1.304956
H  -0.272652 1.417166 0.171185
H  -0.962003 -1.487239 -0.62923
H  0.627465 -0.116237 -2.082026
H  -1.469648 0.896409 -2.163242
H  -3.610924 -2.075962 0.184527
H  -5.687644 -0.441304 0.957196
H  -4.691277 2.149865 0.706705
