program: Gaussian 09
title: 000036989
version: EM64L-G09RevD.01
frameworkgroup: C1[X(C17H21NO2S)]
method: RPBEPBE
basis: SDD
operation: Freq
keyword: #p
keyword: freq=noraman
keyword: PBEPBE/SDD
title: #p freq=noraman PBEPBE/SDD
converged: YES YES NO NO
title: Mulliken charges:
elementType: S O O N C C C C C C C C C C C C C C C C C H H H H H H H H H H H H H H H H H H H H H
charge: 0.178618 -0.466478 -0.435861 -0.306868 -0.483107 -0.187022 -0.385409 0.465967 -0.328026 -0.677683 -0.408142 -0.361814 -0.391915 -0.344032 0.279952 -0.150181 -0.170084 -0.250973 -0.249296 -0.212766 -0.240630 0.183609 0.236846 0.222603 0.201172 0.241566 0.242537 0.207207 0.227254 0.273905 0.248560 0.252398 0.268670 0.332151 0.218266 0.247458 0.245105 0.241003 0.225814 0.228290 0.351368 0.229968
chargesum: 0.00000
title: Mulliken charges with hydrogens summed into heavy atoms:
elementType: S O O N C C C C C C C C C C C C C C C C C
charge: 0.178618 -0.134328 -0.084492 -0.064330 -0.062652 0.035581 0.057330 0.465967 0.106435 -0.155219 -0.155744 -0.093144 -0.173650 -0.096573 0.279952 -0.150181 0.075021 -0.009970 -0.023482 0.015524 -0.010662
polarizability: 2.82121360e+02 -2.24902243e+01 1.94684476e+02 -2.06888561e+01 -1.43255071e+01 1.70605046e+02
1716.lowfreq: -7.4927 -0.0013 -0.0009 -0.0005 1.5444 4.0611 11.1461 17.0448 20.4961
frequency: 10.5629 16.9479 20.4219 26.7109 41.0455 57.7240 88.0812 92.7614 116.4163 148.1257 166.5430 179.5910 187.1151 197.3342 219.8240 262.6582 286.5606 299.5858 319.2780 357.8883 373.8517 395.9873 402.2593 410.9802 412.4563 426.3205 436.0166 469.0896 526.5738 550.0806 566.3674 611.5936 633.5739 675.6058 687.5109 692.7646 706.0559 725.6427 729.0002 741.8571 802.3403 806.2968 809.3682 836.6803 841.0304 864.5914 896.4106 906.0276 940.3820 966.2518 973.0889 978.8895 983.5246 986.8484 993.2549 1005.8645 1019.7183 1033.6918 1051.8451 1058.3173 1074.4419 1082.5424 1089.8696 1104.4625 1133.6369 1141.5838 1146.8867 1156.7079 1172.5715 1178.2993 1192.3404 1217.9813 1226.3102 1237.8849 1246.7875 1254.1610 1284.1125 1287.6875 1311.6428 1312.7697 1333.0176 1343.1576 1375.7672 1385.1737 1391.0512 1404.7966 1428.6296 1428.9079 1441.7950 1453.2566 1462.4671 1466.4420 1483.3758 1495.9303 1506.7364 1583.7950 1594.9328 1598.9450 1627.2566 2878.2956 2888.3201 2943.7917 2985.4206 3006.1267 3023.7873 3027.2724 3043.7370 3092.6799 3108.8104 3125.1535 3131.4943 3134.5674 3145.2937 3153.0908 3158.3665 3169.1365 3173.8342 3410.2293 3556.5006 3580.8371
redmass: 6.3035 6.1994 4.3718 4.9537 4.1470 5.2651 4.1418 4.4802 1.9680 3.9788 4.0543 4.7715 5.0480 3.1208 3.8835 1.3692 3.4783 2.5356 3.6198 1.1143 4.8395 4.2161 2.8455 3.0388 4.5601 4.3027 6.1549 3.1818 3.2366 3.0474 3.4326 6.4357 7.0072 6.3474 1.9052 2.1646 2.9180 2.7031 3.7352 1.5375 1.5740 1.9602 1.4567 1.2457 1.4622 2.0979 1.3745 1.9792 1.3831 1.3789 1.5087 3.5882 6.2554 1.3135 1.4369 2.7748 3.2134 2.8754 2.5934 1.9567 2.5743 1.6355 2.1867 1.5351 1.7172 1.4681 1.6925 1.3775 1.0501 1.1369 1.1260 1.3979 1.4297 1.3399 2.4314 1.3325 1.1421 1.1314 1.3245 1.3249 1.3481 1.3250 6.5064 1.8626 2.0985 2.2634 2.2204 2.3654 1.1916 1.1240 1.1498 1.8703 1.0822 1.0831 2.8055 6.0653 5.9464 6.5290 6.3988 1.0716 1.0705 1.0675 1.0845 1.0593 1.0875 1.0869 1.0945 1.1072 1.0877 1.0847 1.0880 1.0962 1.0934 1.0879 1.0948 1.1005 1.0970 1.0739 1.0659 1.0659
irintensity: 0.0877 0.6051 0.3677 0.7608 1.5011 0.1859 3.2178 1.0503 1.0099 3.2987 1.7333 0.2317 3.0844 3.7650 0.6507 81.3875 0.8569 53.0039 4.4157 144.6909 9.5477 5.7136 0.0215 1.9539 5.8644 3.0258 6.0454 11.4746 21.5899 29.3464 1.7594 0.4125 0.1366 26.1347 58.7548 35.8591 7.8487 32.7096 4.7599 83.7776 11.2459 3.4829 37.6251 0.8351 50.9210 33.5024 1.3607 2.0069 4.4021 0.1299 11.2062 68.9945 2.2583 0.5769 10.9413 3.1258 27.2385 3.7138 1.0239 1.4045 36.5144 7.9609 21.6857 27.9562 12.5139 236.7631 80.7564 63.8408 0.3076 8.7213 0.3573 4.9792 6.0213 9.3430 15.8676 11.3199 0.6525 2.3849 17.0855 8.5555 5.6375 8.3288 2.0877 7.6262 5.1753 18.8308 6.4823 28.4663 52.2958 16.2262 2.3200 43.5729 15.1667 8.0998 78.2138 4.0251 64.1464 12.4997 38.4577 69.4538 119.8713 69.4319 23.6174 14.8561 14.2711 23.0122 46.8724 23.1283 15.4058 3.3750 2.1119 13.7025 20.1509 3.2268 34.8682 14.8087 6.6437 1.4220 6.7618 34.3798
temp: 298.150 k
press: 1.00000 atm
elementType: 16 8 8 7 6 6 6 6 6 6 6 6 6 6 6 6 6 6 6 6 6 1 1 1 1 1 1 1 1 1 1 1 1 1 1 1 1 1 1 1 1 1
symmnumber: 1
zpe: 899699.7 jmol-1
zpe.correction: 0.342678 hartree
zpe.thermalcorrener: 0.364066 hartree
zpe.thermalcorrenthalpy: 0.365010 hartree
zpe.thermalcorrgfe: 0.287573 hartree
zpe.sumelectzpe: -1262.074841 hartree
zpe.sumelectthermal: -1262.053453 hartree
zpe.sumelectthermalent: -1262.052508 hartree
zpe.sumelectthermalfe: -1262.129946 hartree
dipole: -2.5225 -1.9011 -0.3149
dipole: 3.1744
quadrupole: -151.2775 -116.1435 -134.2266
quadrupole: -8.5350 -10.5057 -2.1490
quadrupole: -17.3950 17.7391 -0.3441 -8.5350 -10.5057 -2.1490
hfenergy: -1262.4175185 hartree
pointgroup: C01 [X(C17H21N1O2S1)]
dipole: -0.9992532 -0.7452615 -0.0761459 debye
polarizability: 282.2114456|-24.8614076|192.572081|-16.979228|-16.4077583|172.6273551 unknown
InChI: InChI=1S/C17H21NO2S/c19-15-8-6-14(7-9-15)17(20)10-11-18-12-13-21-16-4-2-1-3-5-16/h1-9,17-20H,10-13H2
charge 0 multiplicity 1
42 atoms
S  -3.29952 -0.151488 -1.597299
O  3.974391 -2.310824 1.882838
O  5.159108 3.401484 -0.650857
N  0.30981 -1.836517 -0.502269
C  2.676696 -2.584362 -0.208623
C  2.968522 -1.662898 1.009805
C  1.616505 -2.030846 -1.179826
C  3.536264 -0.312425 0.605101
C  -0.741249 -1.235498 -1.353072
C  -1.949184 -0.856787 -0.479585
C  2.674515 0.789583 0.391617
C  4.929095 -0.140005 0.39855
C  3.182524 2.038288 -0.031061
C  5.451109 1.100367 -0.017115
C  4.574921 2.18875 -0.235769
C  -4.641581 0.232593 -0.403956
C  -4.539105 0.037853 0.994577
C  -5.839669 0.757334 -0.955104
C  -5.630937 0.366136 1.83179
C  -6.922326 1.082378 -0.111048
C  -6.825278 0.888463 1.287946
H  2.344222 -3.577636 0.168281
H  3.622744 -2.748152 -0.759139
H  2.021738 -1.510421 1.565963
H  1.544119 -2.711407 -2.063426
H  1.949345 -1.046448 -1.559528
H  -0.017262 -2.715475 -0.073059
H  -1.071334 -1.90112 -2.187792
H  -0.322017 -0.322859 -1.817472
H  -1.653696 -0.099004 0.264371
H  -2.356683 -1.744226 0.038191
H  1.596931 0.668289 0.557314
H  5.600348 -0.980621 0.598666
H  3.655528 -3.221016 2.110526
H  2.501667 2.88523 -0.189247
H  6.524622 1.247928 -0.168793
H  -3.625255 -0.362148 1.443759
H  -5.924099 0.909165 -2.037288
H  -5.540849 0.211948 2.913138
H  -7.841869 1.486695 -0.54887
H  4.469196 4.101686 -0.762792
H  -7.66711 1.141216 1.941256
