program: Gaussian 09
title: 000036984
version: EM64L-G09RevD.01
frameworkgroup: C1[X(C13H19NO3)]
method: RPBEPBE
basis: SDD
operation: Freq
keyword: #p
keyword: freq=noraman
keyword: PBEPBE/SDD
title: #p freq=noraman PBEPBE/SDD
converged: YES YES NO NO
title: Mulliken charges:
elementType: O O O N C C C C C C C C C C C C C H H H H H H H H H H H H H H H H H H H
charge: -0.337309 -0.256741 -0.414801 -0.381472 -0.218877 -0.373919 0.581976 -0.354731 -0.722927 -0.504992 -0.485268 -0.693927 0.345814 -0.194223 -0.426777 0.313878 -0.321459 0.197066 0.202137 0.189083 0.186474 0.217917 0.211572 0.223690 0.223324 0.302261 0.236735 0.214345 0.205437 0.214931 0.226731 0.252334 0.330125 0.210321 0.265370 0.335904
chargesum: 0.00000
title: Mulliken charges with hydrogens summed into heavy atoms:
elementType: O O O N C C C C C C C C C C C C C
charge: -0.337309 -0.256741 -0.078897 -0.051347 -0.021811 0.017301 0.581976 0.049661 -0.064342 -0.202731 -0.248532 -0.059214 0.345814 0.032508 -0.174443 0.313878 0.154232
polarizability: 2.02658007e+02 6.00748657e+00 1.56831801e+02 7.58587904e+00 -2.03010810e+01 1.23775901e+02
1716.lowfreq: -5.7719 -4.2727 -0.0008 -0.0007 -0.0006 2.5474 15.4222 18.6902 43.0826
frequency: 14.2662 18.5714 43.0744 52.3315 70.8788 72.0724 98.8562 107.6057 144.1166 166.6707 174.9314 229.7121 230.7463 242.2584 260.8041 280.0511 291.4402 307.8312 328.7960 350.6154 408.7551 461.1249 478.5296 491.3567 554.3482 598.2800 614.1113 619.6961 666.7104 696.3187 706.2190 713.4561 743.0958 799.5097 834.5507 863.2915 874.4429 902.8688 907.4352 927.3226 929.3898 940.5833 975.6462 987.1806 993.7905 1024.4467 1032.7032 1062.1525 1077.2372 1083.8954 1092.1368 1117.8274 1141.2061 1154.1003 1169.7528 1173.1825 1221.7050 1224.8857 1236.9993 1265.3077 1287.3166 1295.3001 1310.2610 1325.3330 1341.4633 1348.7260 1384.0096 1386.3748 1389.4989 1405.2481 1436.8183 1444.4326 1461.8528 1468.6737 1472.8328 1474.5367 1476.4977 1479.3397 1484.6691 1486.6616 1599.0521 1604.5568 1684.3885 2961.6404 2966.8319 2971.0458 2972.1754 2974.4339 2997.8330 3008.4716 3033.6223 3068.1280 3070.7085 3071.2361 3076.7449 3124.2470 3128.5552 3146.2775 3170.9440 3191.0083 3557.4367 3563.2921
redmass: 4.7756 4.4239 5.3917 3.3855 2.1178 3.7258 4.7576 3.6872 2.5713 2.9037 2.6356 1.1466 1.0840 4.9020 1.9053 3.1698 3.9753 2.8776 2.0463 4.9940 3.5300 3.1728 3.0906 4.2230 2.8582 1.4589 4.4463 3.2940 6.9384 10.1687 2.1554 3.2599 1.2082 1.5466 3.0042 1.3876 1.8971 1.4143 2.8246 2.1052 2.5169 2.0712 1.3406 5.8391 1.4665 2.0263 1.6437 2.6487 2.1444 2.2667 1.8203 2.1351 2.1870 2.6137 1.9726 1.1665 1.6449 1.4456 1.8890 1.2690 1.2003 1.3193 1.3501 1.1830 1.5553 1.5504 1.9978 1.3361 1.7772 1.1284 2.4978 1.0853 1.0766 1.7690 1.0563 1.0872 1.0459 1.2267 1.5931 1.1362 6.1043 6.8994 9.3179 1.0605 1.0763 1.0392 1.0631 1.0359 1.0680 1.0970 1.1024 1.1004 1.0996 1.0999 1.1000 1.0874 1.0979 1.0928 1.0975 1.0918 1.0665 1.0775
irintensity: 5.8636 3.4758 0.9064 0.1898 0.5355 0.7936 4.7014 3.3672 1.2189 0.8747 12.0791 1.5017 0.2346 0.6113 45.9999 1.5001 20.7255 12.9232 109.4366 11.6703 0.6413 3.2885 4.3293 29.0923 0.3708 97.5618 27.5778 23.7195 2.0182 28.1012 33.2067 17.8521 12.5687 41.8826 10.9389 1.5679 35.5845 0.7000 103.1162 80.0061 182.2115 42.4359 0.8769 0.6042 2.2559 8.7091 33.0464 0.3640 4.5944 10.2579 4.5775 2.6663 116.0889 370.1857 241.0302 0.6592 192.0575 60.6591 34.6301 0.1834 7.9846 28.3786 0.3376 1.2329 1.9900 3.8205 4.7293 12.1684 14.6373 20.3121 70.6038 7.8927 0.9203 216.9136 14.2864 56.8991 24.6106 134.6789 38.5573 27.9853 46.7145 27.6126 229.8999 8.1508 7.0081 58.9681 39.5054 44.9744 78.1309 6.7781 34.6291 42.4639 42.4470 101.8796 33.8584 8.4594 2.7210 23.2105 11.2219 4.6741 7.7040 32.1381
temp: 298.150 k
press: 1.00000 atm
elementType: 8 8 8 7 6 6 6 6 6 6 6 6 6 6 6 6 6 1 1 1 1 1 1 1 1 1 1 1 1 1 1 1 1 1 1 1
symmnumber: 1
zpe: 785669.3 jmol-1
zpe.correction: 0.299246 hartree
zpe.thermalcorrener: 0.317871 hartree
zpe.thermalcorrenthalpy: 0.318815 hartree
zpe.thermalcorrgfe: 0.249493 hartree
zpe.sumelectzpe: -785.906902 hartree
zpe.sumelectthermal: -785.888277 hartree
zpe.sumelectthermalent: -785.887332 hartree
zpe.sumelectthermalfe: -785.956655 hartree
dipole: -1.6476 3.0401 -1.1232
dipole: 3.6357
quadrupole: -75.4679 -106.9839 -101.8420
quadrupole: -10.6216 5.7525 -3.2692
quadrupole: 19.2967 -12.2193 -7.0774 -10.6216 5.7525 -3.2692
hfenergy: -786.2061473 hartree
pointgroup: C01 [X(C13H19N1O3)]
dipole: 0.7140072 1.124299 0.5217023 debye
polarizability: 203.2099603|-4.5694394|151.0117049|-1.161714|24.523937|129.0440436 unknown
InChI: InChI=1S/C13H19NO3/c1-3-5-10(2)11-6-4-7-12(8-11)17-13(16)14-9-15/h4,6-8,10,14-15H,3,5,9H2,1-2H3
charge 0 multiplicity 1
36 atoms
O  1.894791 0.945861 0.164146
O  1.835818 -0.910601 -1.338608
O  5.09326 -2.028682 -0.318552
N  3.831755 0.065966 -0.57027
C  -3.014677 -0.019925 -0.713606
C  -2.96019 -1.540146 -0.387145
C  -1.88879 0.76989 -0.038908
C  -3.140969 -1.871437 1.111187
C  -3.006497 0.212055 -2.249209
C  -0.532623 0.43017 -0.292095
C  -2.18058 1.854054 0.823959
C  -3.098798 -3.389459 1.391009
C  0.492405 1.179961 0.321662
C  -1.139076 2.596338 1.428578
C  0.20742 2.264323 1.181967
C  2.453954 -0.066266 -0.65433
C  4.733344 -0.900475 -1.182072
H  -3.976033 0.369449 -0.317977
H  -1.996932 -1.960081 -0.74268
H  -3.754133 -2.049705 -0.971654
H  -4.107609 -1.455035 1.462996
H  -2.350735 -1.364168 1.698446
H  -3.854929 -0.313387 -2.726164
H  -3.08276 1.287344 -2.492273
H  -2.072922 -0.170532 -2.701837
H  -0.277057 -0.401086 -0.951336
H  -3.225942 2.117661 1.023561
H  -3.231408 -3.606368 2.467006
H  -3.897196 -3.919863 0.837719
H  -2.129867 -3.820924 1.076271
H  -1.375434 3.433407 2.094583
H  1.03221 2.81972 1.637915
H  4.188185 0.818584 0.020726
H  5.637023 -0.360651 -1.527431
H  4.214253 -1.367638 -2.030797
H  5.639439 -1.711354 0.445313
