program: Gaussian 09
title: 000000786
version: EM64L-G09RevD.01
frameworkgroup: C1[X(C5H12O8P2)]
method: RPBEPBE
basis: SDD
operation: Freq
keyword: #p
keyword: freq=noraman
keyword: PBEPBE/SDD
title: #p freq=noraman PBEPBE/SDD
converged: YES YES NO NO
title: Mulliken charges:
elementType: P P O O O O O O O O C C C C C H H H H H H H H H H H H
charge: 1.458882 1.427756 -0.647187 -0.765284 -0.641837 -0.463414 -0.566771 -0.652952 -0.679933 -0.565673 -0.322850 0.451958 -0.338759 -0.436470 -0.790411 0.252732 0.241886 0.245250 0.203033 0.217854 0.225083 0.223804 0.285159 0.403926 0.356705 0.402540 0.474973
chargesum: 0.00000
title: Mulliken charges with hydrogens summed into heavy atoms:
elementType: P P O O O O O O O O C C C C C
charge: 1.458882 1.427756 -0.647187 -0.765284 -0.237912 -0.106709 -0.566771 -0.250412 -0.204960 -0.565673 0.171768 0.451958 -0.093509 -0.015582 -0.056365
polarizability: 1.68348124e+02 -6.30893717e+00 1.33245867e+02 -5.71871814e+00 2.51637465e+00 1.10943818e+02
1716.lowfreq: -8.0640 -0.0012 0.0005 0.0012 2.7787 7.7337 15.6935 18.1158 24.1062
frequency: 14.8465 17.8084 23.9484 36.4551 45.4592 62.8643 83.4999 125.8191 146.8286 167.9242 169.6876 186.7354 195.0612 214.3101 236.3008 247.3339 259.5648 272.2286 314.5233 320.8467 332.6100 337.3364 356.6458 371.3942 382.9720 406.0278 440.8482 496.1875 549.0529 566.9035 664.0913 693.6494 715.5028 727.2180 781.9600 790.1070 791.9065 846.3490 888.0266 954.2163 965.7777 974.1887 1016.0887 1017.5684 1020.0152 1056.3596 1073.5070 1081.6149 1127.8093 1164.3574 1200.2755 1206.9491 1245.5740 1254.3000 1336.4216 1377.5371 1394.2037 1407.8823 1449.7016 1465.2231 1466.4072 1489.4405 1681.7196 2919.1052 2981.8846 2996.9954 3018.6573 3064.2444 3065.8249 3098.4210 3108.5559 3119.0903 3581.8043 3587.9749 3591.2066
redmass: 3.9224 6.7263 6.1645 7.9994 5.3402 4.5823 4.9818 1.3715 2.1260 7.2554 2.0193 2.9186 3.4491 1.2705 2.9600 3.2898 2.3740 7.3941 2.4013 3.1540 9.0590 5.5164 7.3683 5.7982 6.9410 2.9404 5.7388 3.9186 6.6172 2.6095 8.0785 3.7959 2.8235 2.0749 6.8167 7.3443 3.9856 3.3654 2.1149 1.6350 2.4369 2.2378 1.4788 1.4087 1.3822 1.7046 7.9775 4.0482 2.5249 1.3152 1.1098 1.0984 1.2711 1.5402 1.2603 1.3797 1.5092 1.3114 1.0510 1.0991 1.0720 1.0974 6.4989 1.0615 1.0408 1.0986 1.0607 1.0718 1.0874 1.1016 1.0981 1.0959 1.0667 1.0663 1.0663
irintensity: 0.6966 0.8446 0.0260 4.3421 4.0204 3.0555 0.6387 3.6080 17.7335 13.1944 33.1755 14.5922 15.0957 107.5200 37.0034 11.3849 90.1738 5.6410 42.6450 19.0173 2.1486 99.9033 54.7775 40.3091 34.6709 22.4609 49.7274 17.7221 28.3630 2.5260 50.2573 77.0460 41.0466 281.7843 229.9122 412.4156 203.1227 230.3417 188.5561 46.2146 8.3700 43.6488 36.0933 15.4946 12.1046 6.5031 213.6178 162.0523 16.8425 42.3722 6.4860 3.9234 135.4630 25.5896 26.2013 8.4794 27.6940 9.7172 12.9667 11.3593 14.3766 30.9251 61.9929 58.3096 13.8739 44.1855 39.0969 615.9267 75.9979 1.7560 8.6101 26.7773 6.2159 106.7415 67.5706
temp: 298.150 k
press: 1.00000 atm
elementType: 15 15 8 8 8 8 8 8 8 8 6 6 6 6 6 1 1 1 1 1 1 1 1 1 1 1 1
symmnumber: 1
zpe: 489522.3 jmol-1
zpe.correction: 0.186449 hartree
zpe.thermalcorrener: 0.206480 hartree
zpe.thermalcorrenthalpy: 0.207424 hartree
zpe.thermalcorrgfe: 0.134118 hartree
zpe.sumelectzpe: -1480.718263 hartree
zpe.sumelectthermal: -1480.698232 hartree
zpe.sumelectthermalent: -1480.697288 hartree
zpe.sumelectthermalfe: -1480.770594 hartree
dipole: 5.1805 2.9942 2.5303
dipole: 6.4966
quadrupole: -84.7251 -105.0800 -107.2992
quadrupole: -8.0194 2.6245 -17.0485
quadrupole: 14.3097 -6.0452 -8.2644 -8.0194 2.6245 -17.0485
hfenergy: -1480.9047122 hartree
pointgroup: C01 [X(C5H12O8P2)]
dipole: 1.947911 -1.5876243 -0.4668941 debye
polarizability: 169.1566843|6.0008341|130.547078|0.6872899|-7.0975215|112.8340472 unknown
InChI: InChI=1S/C5H12O8P2/c1-5(4-6)2-3-12-15(10,11)13-14(7,8)9/h2,6-8,10H,3-4H2,1H3
charge 0 multiplicity 1
27 atoms
P  -2.02112 -1.052527 0.803365
P  -2.518728 1.921253 -0.268322
O  -0.43695 -0.427305 0.50355
O  -2.90168 0.388415 0.545886
O  -1.964981 -1.211229 2.511338
O  4.404824 1.76615 -0.306845
O  -2.464341 -2.344534 0.006011
O  -2.580121 1.460638 -1.923575
O  -0.867193 2.106243 -0.028432
O  -3.489974 3.073213 0.184705
C  0.737097 -1.380923 0.323382
C  2.936999 -0.126702 0.041167
C  1.77224 -0.638046 -0.459016
C  3.927588 0.514438 -0.917826
C  3.377682 -0.164725 1.485967
H  0.352299 -2.261858 -0.222526
H  1.06736 -1.672421 1.332242
H  1.54756 -0.506099 -1.52609
H  4.781425 -0.184526 -1.073205
H  3.442699 0.700237 -1.897974
H  2.610129 -0.560852 2.168806
H  4.296736 -0.772967 1.597832
H  3.641941 0.859341 1.802519
H  -2.735491 -1.688908 2.913594
H  5.080751 2.185106 -0.895703
H  -3.479035 1.518735 -2.337928
H  -0.384115 1.229756 0.172477
