program: Gaussian 09
title: 000036977
version: EM64L-G09RevD.01
frameworkgroup: C1[X(C15H21NO4)]
method: RPBEPBE
basis: SDD
operation: Freq
keyword: #p
keyword: freq=noraman
keyword: PBEPBE/SDD
title: #p freq=noraman PBEPBE/SDD
converged: YES YES NO NO
title: Mulliken charges:
elementType: O O O O N C C C C C C C C C C C C C C C H H H H H H H H H H H H H H H H H H H H H
charge: -0.272512 -0.258328 -0.277710 -0.284466 -0.616963 0.154820 -0.019063 0.151451 -0.359851 -0.728838 0.318991 0.331952 -0.379520 -0.603898 -0.608492 0.482201 -0.800893 -0.804865 -0.814890 0.293699 0.265906 0.221312 0.214847 0.245842 0.227346 0.226559 0.244911 0.234475 0.234768 0.234113 0.244125 0.214027 0.230208 0.252308 0.229594 0.212659 0.234956 0.223477 0.223812 0.340658 0.341270
chargesum: 0.00000
title: Mulliken charges with hydrogens summed into heavy atoms:
elementType: O O O O N C C C C C C C C C C C C C C C
charge: -0.272512 -0.258328 -0.277710 -0.284466 0.064965 0.154820 0.246843 0.151451 0.076308 -0.029091 0.318991 0.331952 0.099866 -0.369130 -0.374378 0.482201 -0.112533 -0.110304 -0.132645 0.293699
polarizability: 1.92752321e+02 4.24361905e+00 1.93338809e+02 -2.13307565e+01 8.20510061e+00 1.51275486e+02
1716.lowfreq: -0.0011 -0.0008 -0.0007 3.2790 6.1700 12.6555 20.3632 28.2400 33.8512
frequency: 20.3375 28.1978 33.8304 44.5224 51.8607 64.1238 85.4698 114.0861 157.5477 164.4958 176.3862 184.5580 193.1933 208.7634 218.1282 223.7864 263.8438 284.5445 297.0093 299.2161 331.4057 347.3116 369.9894 389.9355 458.6079 483.6538 503.1523 515.2369 521.3273 526.4245 527.5177 551.1753 567.9274 574.0431 615.8122 625.2027 685.9132 704.2998 717.5769 752.1743 782.7119 787.6626 820.4398 866.0191 874.5513 896.4071 921.8025 934.2593 960.8354 964.4928 1008.8954 1015.6455 1023.7937 1026.3474 1034.5665 1035.5255 1041.9229 1049.1427 1051.9943 1059.3093 1062.1106 1101.3190 1129.0558 1156.0469 1181.6383 1194.3435 1236.4411 1256.5546 1263.1494 1301.3326 1303.5695 1306.6762 1314.2207 1342.9045 1348.8316 1383.4524 1390.1869 1394.7622 1399.0731 1405.4917 1413.2247 1427.5288 1430.7666 1454.5751 1455.5561 1464.3117 1469.3567 1471.0800 1472.2749 1474.2775 1477.3164 1485.3080 1579.2021 1588.1152 1617.5946 1688.0278 2973.1393 2988.7856 2991.2437 2992.7236 3005.3512 3008.7501 3025.3530 3054.0787 3063.9333 3072.5920 3075.4742 3082.1173 3086.9841 3091.3948 3110.3918 3111.5094 3114.2952 3114.7112 3118.0322 3557.6584 3716.0059
redmass: 5.0532 4.4566 1.0537 4.4226 4.3278 4.4572 4.2670 3.1682 1.0892 3.9028 1.9962 1.2344 1.3177 2.8319 2.8076 2.6004 3.1170 3.6253 3.5520 3.0769 4.2118 2.7249 3.6435 3.8951 2.7327 3.3740 1.1750 3.5244 3.6883 1.1105 3.4654 4.0661 3.7177 4.1474 3.4172 5.6372 4.8689 10.5420 6.6445 3.6339 2.9537 3.6910 3.4461 1.3300 3.0705 1.3054 2.0224 2.6455 3.4781 7.0457 5.6466 1.7176 2.5322 1.7667 1.5319 1.5993 1.5557 1.6156 2.7158 2.1703 2.4748 1.9658 2.0819 2.9271 1.4603 1.6050 2.8073 1.4592 1.1906 1.4444 3.6430 1.6023 1.8121 1.4961 4.6820 1.2611 1.4562 1.2332 1.4820 1.2613 1.6991 1.7947 1.1226 1.0556 1.0644 1.0745 1.0733 1.0670 1.0539 1.1591 1.0982 1.4305 6.8163 1.2138 5.7701 7.1663 1.0382 1.0389 1.0455 1.0540 1.0796 1.0351 1.0604 1.0952 1.1068 1.0982 1.0983 1.0998 1.0980 1.0977 1.0907 1.0991 1.1044 1.0919 1.1012 1.0446 1.1058
irintensity: 0.3450 0.5524 0.3207 2.2249 1.1429 5.9641 3.5877 6.5764 0.4929 4.6447 1.5511 2.3685 1.2520 1.5233 0.5727 0.4663 0.0612 1.9012 5.9389 17.6714 3.7374 0.3576 9.6736 1.9035 6.3807 9.4802 272.1941 1.3808 35.0856 50.0337 0.1679 1.1844 1.4813 1.9691 8.4829 0.9774 1.5302 42.4544 3.9059 1.3578 44.4859 15.4385 12.7631 9.8231 72.6303 0.0948 20.2536 2.0090 8.2349 108.5931 108.1348 4.6689 22.5619 10.6005 1.2960 0.7961 1.9929 20.5232 37.2496 14.5219 16.0982 27.5515 4.7900 112.7948 7.8640 10.7223 38.9476 1.9861 5.0251 78.3951 24.4081 58.8578 200.0591 9.8585 1.5766 35.5978 8.0872 12.2586 21.1708 4.7065 2.7302 10.0722 31.0071 16.5346 3.8005 0.8423 18.5082 7.5592 15.9819 26.8199 3.1331 21.6582 16.6985 93.0339 34.3497 337.8641 39.8536 55.0868 31.3404 14.2837 32.9383 12.1286 20.3340 23.1933 38.8520 21.8593 29.8228 16.8298 17.1710 22.0079 32.5708 12.2623 4.5769 21.7194 20.9343 68.6034 51.3126
temp: 298.150 k
press: 1.00000 atm
elementType: 8 8 8 8 7 6 6 6 6 6 6 6 6 6 6 6 6 6 6 6 1 1 1 1 1 1 1 1 1 1 1 1 1 1 1 1 1 1 1 1 1
symmnumber: 1
zpe: 884238.4 jmol-1
zpe.correction: 0.336789 hartree
zpe.thermalcorrener: 0.358080 hartree
zpe.thermalcorrenthalpy: 0.359024 hartree
zpe.thermalcorrgfe: 0.284999 hartree
zpe.sumelectzpe: -938.323181 hartree
zpe.sumelectthermal: -938.301890 hartree
zpe.sumelectthermalent: -938.300945 hartree
zpe.sumelectthermalfe: -938.374970 hartree
dipole: -0.6791 1.5202 1.0802
dipole: 1.9847
quadrupole: -107.1565 -110.0553 -120.9350
quadrupole: -3.6526 -9.5643 6.9435
quadrupole: 5.5591 2.6603 -8.2194 -3.6526 -9.5643 6.9435
hfenergy: -938.6599692 hartree
pointgroup: C01 [X(C15H21N1O4)]
dipole: 0.222628 0.6932368 -0.2820979 debye
polarizability: 193.2803485|0.3346203|194.8923722|-21.2003794|-0.058826|149.1938956 unknown
InChI: InChI=1S/C15H21NO4/c1-9-5-10(2)13(11(3)6-9)15(4)19-8-12(20-15)7-18-14(16)17/h5-6,12H,7-8,16H2,1-4H3
charge 0 multiplicity 1
41 atoms
O  1.017276 -0.734199 -1.102314
O  -0.089705 -2.527102 -0.174274
O  3.681776 0.363231 -0.247735
O  3.648873 1.124548 1.989542
N  4.431233 2.456093 0.216997
C  -0.327264 -1.33887 -1.037572
C  1.553169 -0.817018 0.274085
C  -1.376652 -0.372996 -0.4308
C  0.881516 -2.10562 0.85354
C  -0.689604 -1.838368 -2.433592
C  -2.497325 -0.884701 0.303061
C  -1.291808 1.037082 -0.683985
C  3.073903 -0.907543 0.205353
C  -3.453775 0.022212 0.825042
C  -2.277797 1.896549 -0.137193
C  -3.355626 1.418456 0.639397
C  -2.760919 -2.366589 0.551493
C  -0.213915 1.698887 -1.537831
C  -4.373685 2.368511 1.244863
C  3.900518 1.314511 0.77271
H  1.245656 0.075805 0.852426
H  1.58895 -2.943086 0.985611
H  0.372095 -1.889953 1.811483
H  0.107731 -2.502092 -2.805389
H  -1.641386 -2.39392 -2.403529
H  -0.808574 -0.986384 -3.123344
H  3.379244 -1.648317 -0.550398
H  3.481009 -1.162513 1.200769
H  -4.305151 -0.382807 1.387121
H  -2.199891 2.97323 -0.335717
H  -2.105598 -2.775506 1.340006
H  -3.809715 -2.508336 0.868009
H  -2.580609 -2.988303 -0.340589
H  0.754736 1.760133 -1.011483
H  -0.011962 1.14918 -2.472109
H  -0.529451 2.724761 -1.799461
H  -4.068213 2.682374 2.262207
H  -4.482711 3.285085 0.638474
H  -5.367568 1.894986 1.333319
H  4.598913 2.50965 -0.784873
H  4.654604 3.237938 0.82578
