program: Gaussian 09
title: 000036966
version: EM64L-G09RevD.01
frameworkgroup: C1[X(C13H12F6O2)]
method: RPBEPBE
basis: SDD
operation: Freq
keyword: #p
keyword: freq=noraman
keyword: PBEPBE/SDD
title: #p freq=noraman PBEPBE/SDD
converged: YES YES NO NO
title: Mulliken charges:
elementType: F F F F F F O O C C C C C C C C C C C C C H H H H H H H H H H H H
charge: -0.131469 -0.131685 -0.148600 -0.131412 -0.138897 -0.152097 -0.480992 -0.453346 0.094051 -0.533116 -0.139213 0.349610 0.362685 -0.168312 -0.357976 0.495014 -0.392781 -0.401736 -0.233316 -0.235667 -0.241985 0.271971 0.278619 0.235168 0.252581 0.394903 0.372630 0.224880 0.227136 0.228762 0.226560 0.227610 0.230421
chargesum: 0.00000
title: Mulliken charges with hydrogens summed into heavy atoms:
elementType: F F F F F F O O C C C C C C C C C C C C C
charge: -0.131469 -0.131685 -0.148600 -0.131412 -0.138897 -0.152097 -0.086089 -0.080716 0.094051 0.017473 0.095955 0.349610 0.362685 0.084269 -0.133097 0.495014 -0.165645 -0.172973 -0.006756 -0.008057 -0.011564
polarizability: 2.35755263e+02 1.30646639e+01 1.39443548e+02 -2.69941273e+01 2.47171022e+00 1.01954622e+02
1716.lowfreq: -5.7007 0.0003 0.0005 0.0008 0.1152 3.6562 14.8249 22.9219 29.6665
frequency: 14.4799 22.9020 29.6446 34.5795 63.1023 74.1736 82.8490 106.7746 150.8003 161.4442 191.8688 216.0427 226.9638 248.6382 264.0181 284.1227 298.0318 309.0892 310.6111 339.4717 370.4108 392.9671 402.5289 412.0221 440.5399 455.7499 478.3864 492.2278 505.6504 515.5338 529.0542 559.4528 604.4146 611.0804 616.6536 638.8370 691.5350 697.9127 765.1170 819.9848 826.7143 845.6885 860.1938 879.0317 924.1538 946.7236 977.1606 983.9012 986.6729 988.6539 999.2048 1002.9985 1023.4975 1026.8274 1027.6311 1056.9502 1068.8488 1085.0561 1088.2481 1101.5951 1143.0111 1166.4105 1173.0572 1191.6415 1213.3062 1230.7860 1263.6908 1282.2592 1289.3384 1302.4580 1315.9362 1339.1450 1355.3674 1382.5348 1400.7210 1441.9522 1448.5530 1485.9636 1585.3764 1612.8233 1671.0441 3006.3280 3025.3979 3078.0203 3091.2513 3117.0271 3118.0478 3126.4998 3138.9524 3149.5550 3165.6658 3502.4813 3533.7613
redmass: 4.2968 8.6558 8.1359 12.8584 8.5178 6.8116 4.1893 5.2146 8.0359 6.7978 6.2412 5.7358 4.6576 4.8193 5.5510 6.5282 13.6282 6.1829 6.1532 3.4010 4.2316 1.2959 2.8139 9.6125 5.0846 14.5680 4.1697 10.1981 3.7373 1.1952 3.6011 6.4155 6.1528 8.4761 6.5479 8.5187 5.1965 1.8723 1.7444 4.5436 3.8688 1.4117 1.9819 3.4193 1.5000 4.8069 1.3747 1.2567 6.3788 6.1559 1.3220 3.1790 5.7884 4.3568 2.9652 4.2325 3.0652 5.8615 1.9330 4.9498 4.0189 5.1760 1.0770 1.1232 1.2467 1.9933 1.4973 1.3012 1.2289 1.5111 1.4823 1.2687 1.2137 3.9030 1.8970 2.2175 1.0948 2.3189 5.7911 5.9937 6.2188 1.0844 1.0602 1.0902 1.1032 1.0891 1.0876 1.0859 1.0911 1.0960 1.1015 1.0649 1.0657
irintensity: 0.0637 0.2130 0.1359 0.0305 0.3221 0.6683 1.1798 1.2315 1.5884 5.4598 0.2271 1.4668 2.0337 0.3116 9.4675 5.3788 0.7037 12.0467 1.8225 8.0056 8.3001 121.2322 0.4488 9.9738 27.5875 6.3441 0.5391 2.0952 2.3023 160.2112 20.2211 4.4848 5.5218 30.6907 2.8226 15.0124 8.1402 45.6061 61.1101 3.9105 22.9153 2.9582 12.9340 30.0719 0.6815 49.9840 1.3026 64.8868 64.2961 2.9747 18.3747 133.1664 25.9955 15.2384 39.6825 186.2185 190.7323 135.8821 6.5611 195.8722 154.0236 149.2970 1.9432 0.2926 21.0075 6.1475 16.5990 25.0604 2.5931 18.0367 45.3448 12.2978 0.8926 15.1434 56.7442 12.2427 13.6407 18.2122 2.6495 2.6006 12.2381 20.6975 4.3767 18.2825 4.2234 1.2571 27.3169 0.7396 9.9491 41.8468 25.5083 51.4259 42.1611
temp: 298.150 k
press: 1.00000 atm
elementType: 9 9 9 9 9 9 8 8 6 6 6 6 6 6 6 6 6 6 6 6 6 1 1 1 1 1 1 1 1 1 1 1 1
symmnumber: 1
zpe: 600990.6 jmol-1
zpe.correction: 0.228905 hartree
zpe.thermalcorrener: 0.249392 hartree
zpe.thermalcorrenthalpy: 0.250337 hartree
zpe.thermalcorrgfe: 0.176748 hartree
zpe.sumelectzpe: -1250.480191 hartree
zpe.sumelectthermal: -1250.459704 hartree
zpe.sumelectthermalent: -1250.458759 hartree
zpe.sumelectthermalfe: -1250.532348 hartree
dipole: 0.1285 0.8527 -0.0758
dipole: 0.8656
quadrupole: -110.4171 -121.2476 -126.5720
quadrupole: 2.3671 -12.8498 5.6848
quadrupole: 8.9951 -1.8354 -7.1598 2.3671 -12.8498 5.6848
hfenergy: -1250.709096 hartree
pointgroup: C01 [X(C13H12F6O2)]
dipole: 0.0548703 0.2500314 -0.2246177 debye
polarizability: 236.5430103|-5.9652454|128.3322113|-27.6923689|-17.2872137|112.2782112 unknown
InChI: InChI=1S/C13H12F6O2/c14-12(15,16)11(21,13(17,18)19)8-10(20)7-6-9-4-2-1-3-5-9/h1-7,10,20-21H,8H2
charge 0 multiplicity 1
33 atoms
F  -3.534723 -2.084159 0.796558
F  -3.249398 -1.766507 -1.422824
F  -4.883226 -0.640286 -0.306325
F  -2.618293 0.741825 -2.257555
F  -1.624372 2.132821 -0.781777
F  -3.873563 1.918334 -0.768278
O  -2.916989 0.588261 1.424222
O  -0.486181 -0.040542 2.555978
C  -2.551893 0.045129 0.125283
C  -1.10603 -0.517387 0.197839
C  -0.149235 0.263878 1.158175
C  -3.549639 -1.112558 -0.218511
C  -2.663966 1.197616 -0.931523
C  1.273968 -0.19445 0.946597
C  2.215572 0.547719 0.30083
C  3.61818 0.173698 0.028014
C  4.192465 -1.060504 0.448715
C  4.442981 1.087819 -0.6864
C  5.538371 -1.363534 0.163605
C  5.790967 0.784996 -0.973913
C  6.345886 -0.443835 -0.549869
H  -1.150635 -1.556915 0.567714
H  -0.686828 -0.540175 -0.823436
H  -0.229104 1.351025 0.96317
H  1.498795 -1.186003 1.361571
H  -3.828129 0.98393 1.405609
H  -1.438414 0.215944 2.686373
H  1.919895 1.54345 -0.065373
H  3.586783 -1.784198 1.005353
H  4.018027 2.044425 -1.016082
H  5.963279 -2.316983 0.497329
H  6.406467 1.504469 -1.525314
H  7.392083 -0.683403 -0.769755
