program: Gaussian 09
title: 000037083
version: EM64L-G09RevD.01
frameworkgroup: C1[X(C23H31NO3)]
method: RPBEPBE
basis: SDD
operation: Freq
keyword: #p
keyword: freq=noraman
keyword: PBEPBE/SDD
title: #p freq=noraman PBEPBE/SDD
converged: NO YES NO NO
title: Mulliken charges:
elementType: O O O N C C C C C C C C C C C C C C C C C C C C C C C H H H H H H H H H H H H H H H H H H H H H H H H H H H H H H H
charge: -0.290061 -0.228386 -0.438368 -0.121360 0.347885 -0.180860 -0.113231 -0.095261 0.129646 -0.559944 -0.534899 -0.502950 -0.500410 -0.226025 -0.492449 -0.462245 -0.635786 0.520809 -0.503317 0.274689 -0.746036 -0.534073 -0.569767 0.207585 0.279189 -0.543168 -0.764747 0.251291 0.207611 0.239614 0.224495 0.229452 0.219513 0.225785 0.215167 0.202784 0.228061 0.263488 0.213945 0.222828 0.223428 0.223368 0.206202 0.210593 0.224407 0.213198 0.216738 0.208148 0.254633 0.218467 0.234720 0.259171 0.251131 0.287421 0.244701 0.251116 0.246432 0.365632
chargesum: 0.00000
title: Mulliken charges with hydrogens summed into heavy atoms:
elementType: O O O N C C C C C C C C C C C C C C C C C C C C C C C
charge: -0.290061 -0.228386 -0.072736 -0.121360 0.347885 0.070431 0.094379 0.144353 0.129646 -0.105997 -0.089600 -0.084999 -0.008861 -0.012079 -0.046193 -0.032675 -0.200786 0.520809 -0.073381 0.274689 -0.064787 -0.040182 -0.318636 0.207585 0.279189 -0.255747 -0.022498
polarizability: 3.38289739e+02 1.56999091e+01 2.29128045e+02 -2.71600363e+01 -7.70228026e+00 2.25687731e+02
1716.lowfreq: -4.4283 -0.0008 -0.0006 -0.0003 4.6542 14.8386 24.4079 38.9335 51.7324
frequency: 23.8250 38.8925 51.7170 57.6979 69.1785 81.0632 89.8495 94.1858 120.1001 128.1267 139.8280 151.1072 162.9845 174.1970 189.1796 203.0724 209.9308 218.0903 233.0733 252.6057 272.9008 287.5347 307.6156 313.6468 333.2450 341.6206 362.3886 369.8620 384.3218 395.9724 411.6640 415.1354 431.1657 445.5048 451.5208 475.3272 479.4848 500.4917 508.6614 532.1203 567.4176 568.4970 586.3032 598.9818 618.9526 625.6884 649.2898 662.8740 666.9922 677.0217 705.1313 751.4564 764.1428 799.7999 811.8485 819.2114 823.0879 844.2432 850.0570 871.1374 873.2127 893.9571 904.6999 926.5531 931.9606 949.8451 960.3211 971.1847 977.2391 983.1938 986.3559 991.7492 1008.8627 1038.6759 1039.1111 1044.3578 1045.8440 1055.8839 1059.2588 1073.8311 1084.7599 1097.1118 1106.3015 1114.0243 1125.8603 1146.4778 1157.2624 1160.6532 1164.3616 1176.1542 1184.1735 1190.6693 1201.7045 1213.7411 1220.0745 1227.5831 1238.8259 1242.5033 1243.6044 1271.5887 1275.2202 1280.4986 1287.5070 1290.9360 1298.9095 1306.3637 1317.0259 1319.4724 1322.1598 1329.8331 1333.4552 1339.7517 1342.6596 1345.9965 1355.6364 1363.3094 1372.9203 1379.9294 1382.0186 1384.7360 1452.5972 1455.1625 1456.9835 1460.9731 1461.7421 1464.8043 1467.9715 1470.9910 1476.2770 1483.1011 1484.5125 1489.6607 1498.1657 1567.7046 1649.1140 1653.6737 2131.0142 2919.7587 2927.9614 2938.5032 2952.1612 2957.3433 2969.2434 2970.8960 2975.7827 2984.6068 2989.1980 2994.3775 2994.9674 2998.8311 3004.8086 3031.0508 3031.8751 3032.7998 3042.3393 3043.2300 3047.5857 3051.9474 3059.9090 3066.4527 3067.5802 3095.8749 3110.3701 3111.6872 3126.9111 3139.1780 3426.9978 3570.2250
redmass: 6.1712 4.2034 4.3978 1.2473 3.8614 3.5064 3.7272 3.7189 3.6830 3.8897 4.2525 2.2555 3.2956 3.3639 2.8106 3.0523 2.3005 2.2694 2.5257 3.4886 2.6230 2.4747 2.7360 3.1312 3.6100 2.7548 2.5115 2.6616 3.1752 2.9917 2.5987 3.8742 1.9033 4.0749 2.3049 2.6595 3.7306 2.9668 3.6077 4.9901 3.1536 2.8678 3.6361 3.4126 1.8110 1.9213 2.7441 3.4489 1.3045 2.9385 4.9026 1.5407 2.2978 1.5660 2.0625 3.1260 3.5837 2.0475 2.1234 2.5059 2.9384 1.4756 4.0554 3.1765 1.9675 2.3689 2.4546 2.3131 2.2731 2.3943 2.2596 1.8417 2.0832 2.0632 1.6903 2.9055 2.0680 2.5904 2.3366 2.2485 2.2895 1.9723 2.1152 1.7026 2.3719 1.5353 1.7490 1.7935 1.6770 1.3908 1.9583 3.1973 1.7773 1.7229 1.4758 1.2786 1.5780 1.3434 1.3841 1.3023 1.3867 1.4626 1.4079 1.3606 1.2459 1.2891 1.4185 1.3459 1.4396 1.4957 1.3592 1.5154 1.5079 1.4498 1.4428 1.5801 1.4711 1.2273 2.6015 1.2127 1.0576 1.0514 1.0874 1.0860 1.0844 1.0988 1.0669 1.0767 1.0839 1.0614 1.0879 1.0755 1.0612 6.7592 7.6471 9.9124 6.0500 1.0803 1.0783 1.0831 1.0823 1.0650 1.0610 1.0635 1.0687 1.0388 1.0614 1.0621 1.0633 1.0598 1.0372 1.0976 1.0718 1.0933 1.0989 1.0991 1.1011 1.0977 1.1008 1.0930 1.0984 1.0961 1.0980 1.1002 1.0911 1.1016 1.1589 1.0673
irintensity: 0.1410 0.1759 0.0752 1.8328 0.7985 1.5436 1.0333 0.2610 1.1808 1.1084 0.4737 0.0387 1.2264 0.4130 1.0828 3.6567 1.5704 1.1694 1.0620 0.6783 2.2333 0.5453 1.4211 0.2364 12.8092 2.5709 1.0466 9.1368 6.2864 3.1463 23.2597 1.2212 40.1012 1.1421 49.6044 12.7630 4.5145 4.2208 0.6539 10.5586 5.4525 2.3388 9.9522 3.6913 38.9228 28.6211 8.1877 12.2154 47.6858 0.7208 4.9403 10.8391 4.3966 0.4407 3.4941 11.2774 66.7067 54.6922 22.3684 12.0170 50.7753 21.3999 37.2439 130.8548 8.9208 10.6790 21.1585 51.2513 25.4596 1.7422 20.3205 35.2273 6.5204 14.2662 11.1511 4.6216 3.0727 2.8709 1.5446 1.2293 5.0593 4.1940 10.5693 15.6770 9.1665 6.8406 1.2679 6.1093 1.5160 21.2523 14.6017 301.9622 3.1339 2.1993 18.2857 22.3899 33.9389 3.9652 39.6905 7.3857 3.4626 4.3022 1.6693 1.4062 2.2760 1.5732 5.0643 4.3471 3.6357 2.4374 2.7197 4.6945 2.4957 0.8966 3.1507 2.2553 3.8279 32.4638 1.8099 40.7879 21.8796 20.0575 10.6139 8.8281 7.9694 6.1177 12.8154 11.0402 11.2714 13.7204 5.4946 6.2633 2.0984 3.6064 33.0853 182.0439 0.2093 16.8882 0.3501 0.3290 30.3955 49.1905 3.4201 72.9973 10.1000 35.7633 16.8240 14.8672 52.2725 41.2798 2.8812 23.0144 4.7176 88.4335 28.2429 36.8345 55.1779 34.4033 24.8874 14.0004 50.3047 7.9568 27.3496 12.9261 10.1137 12.2596 62.5698 67.5693
temp: 298.150 k
press: 1.00000 atm
elementType: 8 8 8 7 6 6 6 6 6 6 6 6 6 6 6 6 6 6 6 6 6 6 6 6 6 6 6 1 1 1 1 1 1 1 1 1 1 1 1 1 1 1 1 1 1 1 1 1 1 1 1 1 1 1 1 1 1 1
symmnumber: 1
zpe: 1289824.4 jmol-1
zpe.correction: 0.491268 hartree
zpe.thermalcorrener: 0.517717 hartree
zpe.thermalcorrenthalpy: 0.518662 hartree
zpe.thermalcorrgfe: 0.436040 hartree
zpe.sumelectzpe: -1173.310418 hartree
zpe.sumelectthermal: -1173.283969 hartree
zpe.sumelectthermalent: -1173.283025 hartree
zpe.sumelectthermalfe: -1173.365646 hartree
dipole: 0.7624 -0.3681 -2.1012
dipole: 2.2654
quadrupole: -176.0821 -156.3616 -158.8624
quadrupole: -4.5871 -11.1888 -3.6740
quadrupole: -12.3134 7.4071 4.9063 -4.5871 -11.1888 -3.6740
hfenergy: -1173.8016866 hartree
pointgroup: C01 [X(C23H31N1O3)]
dipole: -0.2904756 -0.0544572 0.8408362 debye
polarizability: 337.0942789|-19.8752722|231.2280259|-26.6776773|7.7982663|224.7832103 unknown
InChI: InChI=1S/C23H31NO3/c1-4-22-12-10-19-18-9-7-17(24-26)14-16(18)6-8-20(19)21(22)11-13-23(22,5-2)27-15(3)25/h2,14,18-21,26H,4,6-13H2,1,3H3
charge 0 multiplicity 1
58 atoms
O  -4.15647 -0.578129 0.258565
O  -5.710743 0.128466 -1.349813
O  6.638823 -2.049527 -1.247031
N  6.248163 -0.627645 -1.173588
C  -1.712275 -0.043126 0.434613
C  -0.833952 1.030771 -0.300746
C  0.543343 1.254978 0.354801
C  1.313534 -0.107277 0.420243
C  -2.996156 0.036996 -0.489682
C  -0.937338 -1.379271 0.431561
C  -1.790128 2.236439 -0.481863
C  0.456291 -1.211247 1.094241
C  -3.190154 1.584753 -0.727116
C  2.696001 0.127154 1.13044
C  1.367612 2.337756 -0.386229
C  -2.082159 0.410151 1.892747
C  2.781975 2.52104 0.240278
C  3.461348 1.172226 0.325506
C  3.568418 -1.124191 1.399033
C  -2.833482 -0.693887 -1.7606
C  -2.579274 -0.690053 2.859322
C  4.331732 -1.62336 0.151219
C  4.595862 0.868817 -0.380362
C  5.125333 -0.493478 -0.478708
C  -5.441826 -0.494304 -0.301465
C  -2.691884 -1.302102 -2.822248
C  -6.419487 -1.281496 0.54766
H  -0.631388 0.619799 -1.315109
H  0.40195 1.611189 1.399618
H  1.511886 -0.4231 -0.628327
H  -0.797865 -1.714734 -0.614648
H  -1.507518 -2.174514 0.945493
H  -1.489419 2.881598 -1.325049
H  -1.797886 2.865518 0.42867
H  0.344287 -0.979085 2.17361
H  0.985956 -2.180853 1.036792
H  -3.946566 1.96456 -0.017956
H  -3.576292 1.77238 -1.739621
H  2.449427 0.576005 2.119683
H  0.827796 3.303996 -0.365111
H  1.4795 2.048554 -1.45137
H  -2.853632 1.200706 1.844331
H  -1.19222 0.884855 2.347219
H  2.663513 2.95738 1.254555
H  3.376618 3.232384 -0.361963
H  2.95996 -1.945173 1.818964
H  4.313878 -0.858716 2.174255
H  -2.882419 -0.233262 3.820454
H  -3.446931 -1.224381 2.44134
H  -1.791262 -1.431226 3.084458
H  3.625959 -2.019632 -0.607411
H  5.010677 -2.455314 0.405201
H  5.123318 1.644718 -0.948771
H  -2.58893 -1.820925 -3.757384
H  -6.239657 -1.104458 1.620707
H  -6.280877 -2.361759 0.360231
H  -7.449402 -1.002895 0.280456
H  7.485034 -1.99787 -1.760593
