program: Gaussian 09
title: 000000745
version: EM64L-G09RevD.01
frameworkgroup: C1[X(C10H17N3O6S)]
method: RPBEPBE
basis: SDD
operation: Freq
keyword: #p
keyword: freq=noraman
keyword: PBEPBE/SDD
title: #p freq=noraman PBEPBE/SDD
converged: YES YES NO NO
title: Mulliken charges:
elementType: S O O O O O O N N N C C C C C C C C C C H H H H H H H H H H H H H H H H H
charge: -0.015644 -0.282576 -0.283102 -0.418089 -0.240376 -0.452838 -0.208499 -0.405708 -0.654456 -0.371948 -0.369590 -0.553358 -0.176697 -0.095671 0.243460 -0.712628 0.240100 0.166135 -0.385304 0.183068 0.249578 0.227056 0.261091 0.218394 0.274733 0.208723 0.351077 0.328353 0.252139 0.315386 0.280299 0.360075 0.288177 0.282137 0.112907 0.384597 0.399000
chargesum: 0.00000
title: Mulliken charges with hydrogens summed into heavy atoms:
elementType: S O O O O O O N N N C C C C C C C C C C
charge: 0.097263 -0.282576 -0.283102 -0.033491 -0.240376 -0.053838 -0.208499 -0.054631 -0.058770 -0.011873 0.107044 -0.073873 0.098035 0.113052 0.243460 -0.132136 0.240100 0.166135 0.185010 0.183068
polarizability: 2.17863156e+02 -2.13339168e+00 1.38732944e+02 -3.79791270e+00 -1.58179451e+01 1.37059068e+02
1716.lowfreq: -11.0447 -5.4176 -2.6708 -0.0016 -0.0007 0.0009 13.3530 19.0933 21.3017
frequency: 13.2467 18.8086 20.8466 35.6242 40.1137 41.8112 56.1956 58.2354 68.2275 92.9730 113.2621 127.1611 151.5409 166.8971 179.1888 192.7618 195.9488 224.7208 232.8071 267.7897 280.4638 306.8623 318.3087 342.7961 394.8395 423.7879 441.4148 485.4235 493.4578 509.0689 541.8610 546.2904 567.1715 581.4086 605.0904 610.9672 633.9747 638.3536 650.4638 685.2269 702.9727 717.0061 725.9481 769.9860 788.7637 820.3936 834.8093 911.5163 924.3212 954.1249 978.9067 980.1146 1020.8408 1036.7587 1052.9075 1062.0168 1078.2733 1095.2698 1119.3438 1137.8076 1144.9973 1175.2587 1193.6072 1214.1280 1226.0942 1227.8559 1238.4411 1259.2450 1268.2120 1283.4412 1297.2053 1307.3313 1318.8838 1327.7061 1340.2076 1355.1859 1379.4290 1448.6123 1451.4207 1457.7564 1465.1197 1471.3810 1502.0369 1592.5202 1599.5161 1618.6827 1664.0597 1689.6534 2435.9660 2824.0875 2959.9800 2975.0555 2996.9224 3010.0497 3037.3380 3042.0749 3059.7942 3082.4271 3118.4194 3451.6845 3507.1663 3514.7979 3536.0700 3548.7580 3661.3832
redmass: 8.0705 6.3838 5.7755 9.5534 8.1891 9.4643 8.3363 4.4863 5.4361 7.3546 3.1427 4.8361 4.0781 2.4639 2.6074 1.4316 3.5212 5.2872 1.4225 4.4345 4.0858 6.3024 3.0479 3.6486 4.0487 1.5820 2.6411 2.9758 2.3291 4.5131 4.2681 3.6330 3.4088 3.3314 1.3911 1.9895 2.6193 3.3017 1.4758 3.1683 1.1889 2.2484 1.6351 2.7005 3.1560 2.0141 3.3732 4.8673 2.6122 2.9417 2.0332 2.1589 2.1586 2.8576 3.1668 2.9072 2.1253 3.0403 1.7739 1.6280 1.2470 1.5547 2.0984 1.0867 1.6098 1.7385 1.2945 1.2085 1.6297 1.3159 1.6277 1.8849 1.3289 1.3027 1.6369 1.7396 1.8328 1.1079 1.1030 1.0809 2.3353 1.0942 2.1958 7.9048 1.3227 6.5840 3.8480 9.3298 1.0378 1.0788 1.0814 1.0660 1.0604 1.0603 1.0995 1.0599 1.0960 1.1012 1.1051 1.0777 1.0638 1.0451 1.0646 1.0783 1.1011
irintensity: 0.2041 0.2138 0.5426 1.7918 0.2308 3.2166 4.2530 1.6161 1.4603 5.7431 2.8413 9.7688 4.6008 3.0215 9.2067 24.8240 4.5840 9.3499 20.6310 4.9579 1.9333 1.6088 30.8670 10.7261 39.5078 178.6968 67.2969 44.7450 24.9953 14.0097 45.7524 8.6215 12.1572 8.7251 9.9725 75.2295 68.5382 6.8082 217.5824 36.8579 116.0160 7.7516 8.0655 20.3953 1.6887 3.6203 25.5281 17.3347 16.8126 24.8312 1.5821 3.4810 3.9645 1.4689 207.2010 53.4104 230.6665 18.5378 4.0892 0.4546 4.2093 13.4116 7.3840 0.0940 17.2417 2.4961 8.3189 9.7969 11.1798 29.5365 15.8351 45.1960 18.1720 3.3736 14.4486 23.6627 1.5817 43.2544 18.3056 16.5319 793.7520 19.2466 194.0295 198.4786 182.1391 74.8468 177.7028 265.2570 14.2359 71.3969 18.2920 13.1033 21.9130 16.5881 3.1958 22.0083 3.1964 26.2646 4.4642 121.8206 26.6042 14.4317 36.1463 75.3310 16.6839
temp: 298.150 k
press: 1.00000 atm
elementType: 16 8 8 8 8 8 8 7 7 7 6 6 6 6 6 6 6 6 6 6 1 1 1 1 1 1 1 1 1 1 1 1 1 1 1 1 1
symmnumber: 1
zpe: 737781.5 jmol-1
zpe.correction: 0.281006 hartree
zpe.thermalcorrener: 0.304300 hartree
zpe.thermalcorrenthalpy: 0.305244 hartree
zpe.thermalcorrgfe: 0.222783 hartree
zpe.sumelectzpe: -1403.393919 hartree
zpe.sumelectthermal: -1403.370626 hartree
zpe.sumelectthermalent: -1403.369682 hartree
zpe.sumelectthermalfe: -1403.452143 hartree
dipole: -1.9514 0.9840 -0.4052
dipole: 2.2227
quadrupole: -123.8024 -134.1505 -125.6904
quadrupole: -0.9161 23.6811 -2.4941
quadrupole: 4.0787 -6.2694 2.1907 -0.9161 23.6811 -2.4941
hfenergy: -1403.6749255 hartree
pointgroup: C01 [X(C10H17N3O6S1)]
dipole: -0.7570629 -0.4359879 -0.0383484 debye
polarizability: 217.9422628|1.6405549|151.9017244|2.9795049|-7.3969027|123.811181 unknown
InChI: InChI=1S/C10H17N3O6S/c11-5(10(18)19)1-2-7(14)13-6(4-20)9(17)12-3-8(15)16/h5-6,12-13,15,18,20H,1-4,11H2
charge 0 multiplicity 1
37 atoms
S  -2.117125 -1.394793 -2.71671
O  1.204779 -2.265772 0.232926
O  -1.843622 1.491155 -0.225844
O  4.381763 2.01577 -0.650819
O  6.397874 1.776724 0.462302
O  -5.885193 -0.804499 1.144096
O  -6.899517 1.28981 1.062184
N  0.052427 -0.35169 -0.386335
N  6.073668 -0.913232 0.769044
N  -3.501496 0.032933 0.469863
C  3.634762 -0.615898 0.428356
C  2.509226 -0.341901 -0.59343
C  -1.253658 -0.893338 -0.006439
C  5.070159 -0.249187 -0.05631
C  1.220236 -1.069875 -0.205057
C  -1.729866 -2.010232 -0.971715
C  -2.222848 0.311654 0.064028
C  5.373204 1.249662 -0.024062
C  -4.513393 1.090002 0.5125
C  -5.883094 0.584238 0.926565
H  3.636282 -1.700299 0.644627
H  3.43443 -0.106262 1.388249
H  2.341041 0.740412 -0.720517
H  2.822749 -0.735039 -1.583386
H  -1.168926 -1.361476 0.998209
H  5.124679 -0.523456 -1.143851
H  0.053674 0.65183 -0.612738
H  -0.952897 -2.787946 -1.020298
H  -2.668526 -2.473289 -0.622639
H  6.949246 -0.40789 0.911787
H  6.139249 -1.925492 0.679918
H  -3.806724 -0.918114 0.686711
H  -4.609722 1.579337 -0.476509
H  -4.21675 1.894776 1.212179
H  -0.849555 -0.888843 -2.955825
H  4.65399 2.973559 -0.625457
H  -6.794827 -1.108341 1.406597
