program: Gaussian 09
title: 000036986
version: EM64L-G09RevD.01
frameworkgroup: C1[X(C12H12O6S2)]
method: RPBEPBE
basis: SDD
operation: Freq
keyword: #p
keyword: freq=noraman
keyword: PBEPBE/SDD
title: #p freq=noraman PBEPBE/SDD
converged: YES YES NO NO
title: Mulliken charges:
elementType: S S O O O O O O C C C C C C C C C C C C H H H H H H H H H H H H
charge: 0.274112 0.265905 -0.260500 -0.258805 -0.417013 -0.417079 -0.211865 -0.210993 0.624004 -1.003857 0.203413 -0.410793 0.163834 -0.441854 -0.325209 -0.203383 -0.699721 -0.691162 0.236038 0.235827 0.321414 0.293290 0.241537 0.255793 0.239985 0.243482 0.288148 0.306856 0.302816 0.285299 0.385046 0.385436
chargesum: 0.00000
title: Mulliken charges with hydrogens summed into heavy atoms:
elementType: S S O O O O O O C C C C C C C C C C C C
charge: 0.274112 0.265905 -0.260500 -0.258805 -0.031967 -0.031643 -0.211865 -0.210993 0.624004 -0.682443 0.203413 -0.117504 0.163834 -0.200317 -0.069415 0.280084 -0.104717 -0.103047 0.236038 0.235827
polarizability: 1.99151541e+02 6.43753561e+00 2.06638061e+02 -1.29648693e+00 1.00041817e+01 1.56895594e+02
1716.lowfreq: -7.2531 -4.4913 -1.0011 -0.0020 -0.0018 0.0017 13.2236 16.6952 18.7991
frequency: 13.1255 16.5210 18.6073 19.4609 28.0369 28.8680 38.1324 44.5733 58.7748 76.7706 112.4852 130.0832 153.0782 164.9904 192.5575 218.4902 263.5169 305.8627 356.5411 370.9359 398.0474 419.3362 429.1524 500.1572 501.2502 510.1978 562.9417 564.6585 579.9932 592.1098 628.6870 631.8672 675.8219 687.5268 703.7363 728.5309 743.9038 747.9771 780.4369 785.3651 816.5001 840.5245 869.4745 873.0244 874.1391 892.8861 896.0649 920.1661 925.1256 977.2328 1041.8787 1045.8897 1058.2535 1066.1491 1121.2744 1125.2636 1136.8162 1145.3873 1148.8894 1178.0498 1212.2901 1229.9848 1231.5078 1248.4886 1278.6858 1317.6360 1318.4289 1364.8587 1399.1118 1423.8111 1425.5349 1443.8972 1470.8556 1486.1190 1609.2216 1621.2618 1674.0506 1676.1363 3014.9279 3015.4579 3020.9013 3039.1448 3080.4672 3087.5151 3101.4614 3132.6365 3176.6612 3183.0969 3517.7365 3518.3649
redmass: 6.8173 6.3532 4.5301 3.2541 11.7057 6.8817 3.0224 5.6416 2.9325 12.4109 8.7871 9.5744 9.4200 9.1997 8.6304 6.5608 10.1750 10.4239 6.5194 8.4663 8.4228 5.7137 3.3010 1.8116 1.8611 6.9904 4.9914 4.7602 7.2484 6.2282 1.3843 1.3768 8.5059 5.6833 6.3124 3.6488 6.0202 6.6289 6.2749 7.1842 1.4241 9.9150 4.5639 4.8541 1.5931 1.6780 1.7014 4.0742 1.3495 5.1477 2.1911 2.2385 3.5823 1.4657 1.0599 1.4532 1.1417 1.1558 1.1343 1.7723 1.2058 1.3280 1.3189 5.9823 1.4460 2.0844 2.0929 1.2772 3.6327 1.0999 1.1063 4.6951 2.5370 1.2520 7.8849 8.2892 8.8029 8.8539 1.0569 1.0555 1.0574 1.0866 1.1044 1.1040 1.1169 1.0900 1.0933 1.0954 1.0641 1.0641
irintensity: 0.0978 2.5173 3.8749 5.1472 1.4709 4.4061 0.2244 0.8241 4.4925 0.6111 1.6403 3.7002 0.4924 3.3251 1.7399 1.0213 2.4131 1.9602 0.5768 16.2178 2.3473 7.2777 13.7565 27.1385 37.5421 8.6009 9.5697 82.3254 0.5991 3.2617 115.0469 157.2114 0.1790 19.0237 2.6514 11.4264 55.4095 31.4487 10.9520 2.3050 20.0967 32.6028 2.5032 6.1625 21.3996 1.0710 18.1875 7.3471 0.7707 142.6185 504.2109 160.9075 27.2588 5.1826 0.0628 6.4947 3.4962 2.8036 0.8705 9.5998 3.3095 1.4906 0.2414 291.9130 9.9598 121.2583 5.5031 2.0365 19.0294 60.6136 35.6163 59.8548 135.0110 23.1756 4.6944 2.4389 84.2180 300.6658 26.4670 113.2236 17.7165 10.8848 2.2469 2.6713 27.5841 8.1531 0.3154 4.4090 28.6955 27.6145
temp: 298.150 k
press: 1.00000 atm
elementType: 16 16 8 8 8 8 8 8 6 6 6 6 6 6 6 6 6 6 6 6 1 1 1 1 1 1 1 1 1 1 1 1
symmnumber: 1
zpe: 586507.2 jmol-1
zpe.correction: 0.223389 hartree
zpe.thermalcorrener: 0.244547 hartree
zpe.thermalcorrenthalpy: 0.245491 hartree
zpe.thermalcorrgfe: 0.164783 hartree
zpe.sumelectzpe: -1710.427047 hartree
zpe.sumelectthermal: -1710.405889 hartree
zpe.sumelectthermalent: -1710.404945 hartree
zpe.sumelectthermalfe: -1710.485652 hartree
dipole: 0.3033 4.2473 4.4823
dipole: 6.1825
quadrupole: -111.9010 -131.1653 -134.4150
quadrupole: -0.5391 -3.6464 -16.1725
quadrupole: 13.9261 -5.3382 -8.5879 -0.5391 -3.6464 -16.1725
hfenergy: -1710.6504355 hartree
pointgroup: C01 [X(C12H12O6S2)]
dipole: -0.1288953 -1.6288842 -1.8018098 debye
polarizability: 197.4545788|-5.1262417|207.86082|2.5750892|10.9032459|157.3697964 unknown
InChI: InChI=1S/C12H12O6S2/c13-10(14)4-19-12(20-5-11(15)16)7-1-2-8-9(3-7)18-6-17-8/h1-3,12-13,15H,4-6H2
charge 0 multiplicity 1
32 atoms
S  1.488554 2.243939 0.58295
S  -1.487073 2.158244 0.762287
O  0.18288 -3.179603 1.682176
O  0.053541 -4.226348 -0.476315
O  5.153125 1.217017 -0.811115
O  -5.191835 1.751875 -0.847143
O  4.473958 2.422251 1.059349
O  -4.463514 2.475242 1.241095
C  -0.014009 -0.029439 -0.368866
C  -0.035682 1.476204 -0.284147
C  0.085903 -2.199923 0.664497
C  0.075984 -0.817366 0.820651
C  0.010897 -2.819429 -0.606456
C  -0.086247 -0.656138 -1.639624
C  -0.075253 -2.072993 -1.781807
C  0.072738 -4.490535 0.990435
C  2.802845 1.347008 -0.428371
C  -2.83897 1.69244 -0.464672
C  4.182174 1.744138 0.055052
C  -4.200844 2.026913 0.108557
H  -0.113485 1.930496 -1.286736
H  0.128535 -0.341177 1.802927
H  -0.151098 -0.036139 -2.541234
H  -0.130925 -2.553419 -2.761482
H  -0.877869 -4.973008 1.279429
H  0.958182 -5.100482 1.23176
H  2.703221 1.598066 -1.497639
H  2.676942 0.25579 -0.317876
H  -2.788989 0.610046 -0.678115
H  -2.700662 2.239495 -1.413214
H  6.058404 1.465452 -0.478817
H  -6.085625 1.967082 -0.464537
