program: Gaussian 09
title: 000036969
version: EM64L-G09RevD.01
frameworkgroup: C1[X(C10H10F6O2S)]
method: RPBEPBE
basis: SDD
operation: Freq
keyword: #p
keyword: freq=noraman
keyword: PBEPBE/SDD
title: #p freq=noraman PBEPBE/SDD
converged: YES YES NO NO
title: Mulliken charges:
elementType: S F F F F F F O O C C C C C C C C C C H H H H H H H H H H
charge: 0.262515 -0.159157 -0.153802 -0.125826 -0.154947 -0.152643 -0.117930 -0.411920 -0.523591 -0.182233 0.023913 -0.105481 -0.740895 0.365928 0.365301 -0.137665 -0.291633 -0.126898 -0.504479 0.280859 0.268201 0.256703 0.248740 0.238614 0.398537 0.382084 0.275167 0.251679 0.270858
chargesum: 0.00000
title: Mulliken charges with hydrogens summed into heavy atoms:
elementType: S F F F F F F O O C C C C C C C C C C
charge: 0.262515 -0.159157 -0.153802 -0.125826 -0.154947 -0.152643 -0.117930 -0.013382 -0.141507 0.098626 0.023913 0.162720 0.003161 0.365928 0.365301 -0.137665 -0.016466 0.124781 -0.233621
polarizability: 1.66886865e+02 6.70506448e+00 1.12259093e+02 1.11064725e+01 -1.13027516e+01 1.10369646e+02
1716.lowfreq: -3.9869 0.0009 0.0017 0.0020 6.4553 7.9247 34.2133 38.7913 56.6962
frequency: 34.2060 38.7547 56.6516 63.0600 73.9864 96.4298 139.9373 150.5379 183.8563 189.6237 208.3818 222.3114 242.3119 267.5550 276.0293 292.7301 302.6348 302.9816 321.5784 325.2580 398.7348 411.0751 432.4175 460.1090 464.2863 485.9669 495.8920 509.8896 558.7431 577.9440 585.1653 612.3325 627.6180 663.3828 693.5197 706.5994 751.8729 773.3180 818.3011 845.0188 857.2948 884.2988 915.8924 918.6528 953.1475 980.3485 1005.9112 1031.5494 1033.9431 1050.9163 1062.4047 1080.4735 1081.6687 1103.5826 1132.4143 1134.1944 1165.0423 1170.9664 1220.1476 1239.5550 1293.6059 1312.4760 1323.0908 1350.6689 1379.5266 1414.7617 1467.5119 1481.9338 1487.1299 1492.9667 1550.0715 3006.1529 3018.7973 3026.4650 3109.4975 3111.0111 3127.0894 3172.7879 3190.1360 3240.2666 3600.7622
redmass: 8.7030 7.8291 7.5073 6.4841 10.9728 5.8043 6.6232 4.8498 3.4434 4.2029 5.3537 2.3801 10.4291 7.2448 6.2777 9.4640 1.6384 5.8374 2.9794 4.7570 3.8584 7.0043 7.7452 11.5041 15.0921 7.7789 7.3771 5.1514 4.9544 9.2082 6.0848 4.8751 11.3289 9.8200 7.1651 1.1792 1.1081 4.8664 4.6166 1.3702 3.2993 2.8179 3.9578 1.4783 2.8711 8.6386 5.1510 2.3811 5.0518 9.4546 2.3360 1.2941 4.9788 2.4362 1.9299 2.9728 5.0466 5.0295 1.5055 1.4790 1.3477 1.3898 1.6662 1.5414 1.3886 1.1861 6.6529 1.0629 1.0506 1.2167 5.5865 1.0839 1.0373 1.0841 1.0769 1.0895 1.0994 1.0904 1.0975 1.1004 1.0668
irintensity: 0.5951 0.3384 0.6471 0.0469 0.6662 1.2129 2.6562 0.7347 0.3469 1.2082 0.9752 0.3854 0.5868 0.7679 5.2307 4.2149 73.0393 7.4848 36.2338 5.6779 7.5179 24.6215 11.0262 6.6880 2.5532 8.4957 12.3385 0.0809 15.6940 1.8126 5.9620 18.2045 22.2716 0.7208 1.8302 106.1619 102.1505 19.7317 5.6230 12.7840 20.8859 104.3091 76.0779 10.8761 74.6198 69.1396 46.0965 19.4199 91.8413 341.5159 56.3732 10.1784 93.0383 32.0478 8.2106 50.8261 130.7250 280.8705 19.4677 52.5865 23.5988 3.9521 5.0647 1.4167 8.4243 8.1207 17.7838 13.6673 17.8916 130.3972 2.9315 4.8328 11.3592 7.5650 369.8785 244.3031 18.9795 3.2598 1.5190 0.5092 22.3384
temp: 298.150 k
press: 1.00000 atm
elementType: 16 9 9 9 9 9 9 8 8 6 6 6 6 6 6 6 6 6 6 1 1 1 1 1 1 1 1 1 1
symmnumber: 1
zpe: 501475.3 jmol-1
zpe.correction: 0.191002 hartree
zpe.thermalcorrener: 0.210024 hartree
zpe.thermalcorrenthalpy: 0.210968 hartree
zpe.thermalcorrgfe: 0.143330 hartree
zpe.sumelectzpe: -1533.142977 hartree
zpe.sumelectthermal: -1533.123955 hartree
zpe.sumelectthermalent: -1533.123011 hartree
zpe.sumelectthermalfe: -1533.190649 hartree
dipole: -7.3741 -0.1220 0.4685
dipole: 7.3899
quadrupole: -115.0859 -117.2681 -115.7470
quadrupole: 2.7511 -3.8134 1.8147
quadrupole: 0.9478 -1.2345 0.2866 2.7511 -3.8134 1.8147
hfenergy: -1533.3339792 hartree
pointgroup: C01 [X(C10H10F6O2S1)]
dipole: 2.9052751 -0.0100725 0.111293 debye
polarizability: 166.5749285|4.8002273|113.6878814|-12.6766695|11.2053926|109.2527948 unknown
InChI: InChI=1S/C10H10F6O2S/c1-5(7(17)6-3-2-4-19-6)8(18,9(11,12)13)10(14,15)16/h2-5,7,17-18H,1H3
charge 0 multiplicity 1
29 atoms
S  3.565311 -1.140104 -0.88629
F  -1.203086 -2.286975 0.759172
F  -1.576677 -1.731667 -1.3989
F  -3.24519 -1.562188 0.117469
F  -2.791683 0.837068 -1.639678
F  -1.934191 2.443846 -0.282561
F  -3.661506 1.177751 0.415901
O  -1.575212 0.261115 1.733979
O  0.888107 -0.413098 1.940209
C  0.038657 0.475702 -0.16124
C  -1.429692 0.114825 0.305543
C  1.103795 -0.483521 0.462194
C  0.260154 0.601962 -1.687445
C  -1.873463 -1.349406 -0.067452
C  -2.462199 1.131631 -0.29129
C  2.520122 -0.08271 0.144083
C  3.217285 1.044784 0.560348
C  4.573948 1.10139 0.074979
C  4.922758 0.016513 -0.714467
H  0.211659 1.469002 0.296767
H  0.919846 -1.520502 0.118895
H  -0.473227 1.2811 -2.147952
H  1.262924 1.022901 -1.867638
H  0.194982 -0.368927 -2.204499
H  -0.685914 -0.018304 2.139506
H  1.519622 -1.008736 2.411461
H  2.771972 1.804612 1.207464
H  5.265216 1.915817 0.303328
H  5.86618 -0.198286 -1.212988
