program: Gaussian 09
title: 000036974
version: EM64L-G09RevD.01
frameworkgroup: C1[X(C11H15ClN2S)]
method: RPBEPBE
basis: SDD
operation: Freq
keyword: #p
keyword: freq=noraman
keyword: PBEPBE/SDD
title: #p freq=noraman PBEPBE/SDD
converged: YES YES NO NO
title: Mulliken charges:
elementType: Cl S N N C C C C C C C C C C C H H H H H H H H H H H H H H H
charge: -0.079468 0.164798 -0.017146 -0.111804 0.360289 0.100992 -0.675401 -0.376792 -0.343690 -0.151447 -0.797110 -0.592839 -0.103239 -0.236272 -0.849431 0.256965 0.315285 0.258037 0.238060 0.223542 0.213851 0.247633 0.236865 0.244427 0.227845 0.226878 0.250277 0.256535 0.259323 0.253039
chargesum: 0.00000
title: Mulliken charges with hydrogens summed into heavy atoms:
elementType: Cl S N N C C C C C C C C C C C
charge: -0.079468 0.164798 -0.017146 -0.111804 0.360289 0.100992 -0.103151 -0.118755 -0.105631 0.072095 -0.098761 0.106311 -0.103239 0.014005 -0.080535
polarizability: 2.99891260e+02 -3.84595003e+00 1.52957888e+02 -2.16844171e+00 -5.23262310e+00 8.76212420e+01
1716.lowfreq: -7.4908 -4.1272 -0.0024 0.0010 0.0013 4.9171 26.1937 27.3613 41.8284
frequency: 26.1036 27.1589 41.7733 56.0622 82.8813 87.6087 108.2013 135.8147 143.0039 184.7693 191.4884 193.4616 223.0249 256.0608 270.5582 291.3420 340.4840 379.7828 407.2787 428.2628 451.9402 487.7306 504.9195 554.3806 575.2852 630.6110 657.3947 658.8085 723.6227 786.1684 808.9848 854.1726 863.7440 876.5131 911.8045 929.6799 946.6273 960.3894 991.7596 999.2497 1043.4477 1068.4731 1084.3181 1113.8806 1117.1135 1159.0182 1195.0941 1225.4140 1237.5638 1261.4608 1302.7047 1344.1333 1358.7885 1366.0442 1389.0866 1398.8011 1403.8028 1410.0320 1434.6262 1450.5474 1452.2784 1456.8547 1463.6150 1470.5899 1479.1563 1500.1727 1570.9881 1590.3336 1633.7587 2963.1718 2983.7851 2992.0764 3001.3689 3031.6267 3046.6445 3062.3988 3092.9330 3094.2160 3114.8864 3125.7388 3130.5272 3133.4728 3154.8360 3168.4463
redmass: 5.1714 5.1246 3.4771 3.7189 2.2328 1.3583 1.2873 4.0881 3.1002 3.3914 1.9705 1.6089 4.9457 2.7039 4.2015 3.3027 5.1234 3.2332 4.3223 3.8422 3.1495 4.6437 3.9626 3.5752 4.8770 5.8174 7.0219 7.1438 3.3485 4.7014 1.5340 2.2267 5.5504 1.3355 2.0936 1.3803 1.4760 1.1753 1.5366 1.4489 1.5389 1.6924 1.9506 1.3504 1.7272 1.9974 2.1294 2.7233 1.5517 1.3086 1.3137 1.1328 5.6459 1.4744 2.6950 1.2689 2.0328 1.2667 1.2414 1.0671 1.0544 1.0502 1.0503 1.3191 1.9855 1.1469 8.2000 6.3141 6.6179 1.0370 1.0367 1.0875 1.0291 1.0606 1.0990 1.0960 1.1005 1.0992 1.1055 1.1019 1.0888 1.1054 1.0923 1.0957
irintensity: 1.1186 0.1184 2.0808 0.4520 0.1539 0.6382 0.9406 3.3063 2.1402 0.8969 2.9457 2.6762 0.7993 5.7603 1.7747 4.2240 11.6034 5.3096 13.1567 9.6340 5.6704 13.3629 2.4086 6.7290 0.4585 46.5782 8.0121 13.5151 0.1860 14.0103 45.1083 28.4338 35.9283 18.8879 15.7369 6.1960 43.0652 7.0859 15.4578 19.7736 9.2654 223.7473 29.7790 2.2421 33.9955 27.4137 14.1518 22.8343 143.0060 7.6631 4.2057 1.7019 1.0580 116.9945 59.3627 16.9772 32.1375 21.9683 5.5535 13.8502 18.6622 22.9104 19.7838 13.2022 128.6502 15.6074 24.3658 27.5785 860.0825 79.3679 22.4682 46.6513 45.3839 42.6053 28.3643 15.7697 25.7242 23.7079 23.5175 9.3802 12.0989 2.2230 4.9701 5.1044
temp: 298.150 k
press: 1.00000 atm
elementType: 17 16 7 7 6 6 6 6 6 6 6 6 6 6 6 1 1 1 1 1 1 1 1 1 1 1 1 1 1 1
symmnumber: 1
zpe: 622818.6 jmol-1
zpe.correction: 0.237219 hartree
zpe.thermalcorrener: 0.254503 hartree
zpe.thermalcorrenthalpy: 0.255447 hartree
zpe.thermalcorrgfe: 0.189565 hartree
zpe.sumelectzpe: -1394.651254 hartree
zpe.sumelectthermal: -1394.633971 hartree
zpe.sumelectthermalent: -1394.633027 hartree
zpe.sumelectthermalfe: -1394.698908 hartree
dipole: 5.9471 -3.1097 -0.3578
dipole: 6.7206
quadrupole: -101.8001 -95.9753 -106.4346
quadrupole: -9.3233 0.2639 0.6205
quadrupole: -0.3968 5.4280 -5.0313 -9.3233 0.2639 0.6205
hfenergy: -1394.8884733 hartree
pointgroup: C01 [X(C11H15Cl1N2S1)]
dipole: -2.4012293 -1.1068618 -0.0094975 debye
polarizability: 299.8081711|-3.9883399|151.9828659|4.7438142|9.4216016|88.6793534 unknown
InChI: InChI=1S/C11H15ClN2S/c1-9-6-10(12)4-5-11(9)13-7-14(2)8-15-3/h4-7H,8H2,1-3H3
charge 0 multiplicity 1
30 atoms
Cl 5.665473 -0.218099 0.381701
S  -3.892946 1.479547 0.167432
N  -2.514284 -0.995683 -0.164493
N  -0.360252 -0.018846 -0.244293
C  1.757554 1.092669 0.242131
C  1.042484 -0.109766 -0.073387
C  -3.094827 0.101691 -0.914263
C  3.163518 1.034972 0.381002
C  1.763531 -1.323193 -0.266103
C  -1.159531 -0.978983 0.146998
C  1.007403 2.393556 0.437381
C  -3.42278 -1.910002 0.542333
C  3.844347 -0.185426 0.202565
C  3.167095 -1.371998 -0.127132
C  -5.710128 0.987643 0.036174
H  -3.89091 -0.263283 -1.584904
H  -2.294826 0.604135 -1.475333
H  3.72304 1.942792 0.627461
H  1.224946 -2.228934 -0.568487
H  -0.835582 -1.843875 0.75705
H  1.701362 3.242244 0.561931
H  0.3431 2.591405 -0.422807
H  0.350668 2.347653 1.326111
H  -3.950502 -1.390773 1.366996
H  -2.85108 -2.751526 0.967884
H  -4.172606 -2.319519 -0.159154
H  3.717109 -2.304177 -0.285188
H  -6.023693 0.954811 -1.019751
H  -6.276817 1.77727 0.554613
H  -5.903065 0.019892 0.525233
