program: Gaussian 09
title: 000036976
version: EM64L-G09RevD.01
frameworkgroup: C1[X(C13H21N3O3)]
method: RPBEPBE
basis: SDD
operation: Freq
keyword: #p
keyword: freq=noraman
keyword: PBEPBE/SDD
title: #p freq=noraman PBEPBE/SDD
converged: YES YES NO NO
title: Mulliken charges:
elementType: O O O N N N C C C C C C C C C C C C C H H H H H H H H H H H H H H H H H H H H H
charge: -0.461184 -0.486833 -0.296818 -0.417512 -0.476393 -0.657583 0.263686 -0.453233 -0.245484 -0.717325 -0.677729 -0.683699 0.617969 -0.478886 -0.510478 0.332135 -0.339551 0.080955 0.252378 0.264511 0.224195 0.250969 0.187635 0.231878 0.214643 0.201081 0.232802 0.226336 0.204419 0.202690 0.213462 0.225427 0.319754 0.233037 0.360347 0.214252 0.332602 0.367581 0.342185 0.305778
chargesum: 0.00000
title: Mulliken charges with hydrogens summed into heavy atoms:
elementType: O O O N N N C C C C C C C C C C C C C
charge: -0.100837 -0.119252 -0.296818 -0.153001 -0.143791 -0.009619 0.263686 0.021931 -0.057849 -0.069723 -0.014173 -0.042120 0.617969 -0.159132 -0.277441 0.332135 -0.125299 0.080955 0.252378
polarizability: 2.25923406e+02 -1.92252492e+00 2.02828565e+02 -1.08359813e+01 -6.99643065e+00 1.12326141e+02
1716.lowfreq: -5.7140 -0.0007 -0.0005 0.0001 4.0980 8.4543 11.0864 31.2340 42.7755
frequency: 7.9938 30.3499 42.7285 56.6300 65.6137 82.5512 100.7604 109.6087 171.9916 189.4532 195.7014 229.5954 233.5650 255.8347 258.9566 263.5009 269.8825 290.5401 309.5361 334.0616 344.0324 348.8971 365.0633 397.6506 423.8215 445.7019 452.8052 460.9663 486.1806 495.2279 546.8070 550.7476 583.7933 623.9822 654.2237 661.1889 668.7069 713.9282 731.3857 734.5154 764.0920 789.1432 800.8105 822.2186 857.1410 893.5499 903.8044 907.0952 924.8294 927.7106 942.3957 948.1473 998.0325 1008.3853 1018.5045 1027.2460 1045.3827 1053.8001 1082.6733 1089.8869 1149.8723 1164.2297 1182.2829 1212.1453 1213.7476 1236.1277 1258.0053 1274.1073 1274.9449 1287.6602 1318.4467 1327.5648 1333.5891 1376.9450 1380.2277 1402.3875 1404.1990 1425.2877 1440.7270 1447.9869 1451.8981 1461.7405 1463.0505 1469.6696 1485.2319 1488.1801 1488.2491 1494.7714 1532.3653 1599.4943 1619.5818 1626.3687 1654.4264 2907.7302 2967.4040 2969.9372 2973.0641 2988.5406 3062.7429 3068.5565 3073.7483 3078.6110 3084.0087 3089.5189 3094.2262 3113.4902 3123.2952 3140.6583 3190.1253 3432.4229 3511.8074 3542.9970 3616.1233 3700.3727
redmass: 4.5285 3.8534 3.1730 4.7839 4.1097 4.4874 4.5430 5.0063 1.8043 2.1390 3.5202 2.0822 2.6969 2.1360 1.3226 1.1669 5.0700 1.3868 2.6997 1.5090 2.3668 2.9259 2.9352 4.3498 2.7157 2.2394 2.8490 3.8023 1.1402 2.8132 4.2724 3.4690 3.5927 2.7055 1.6746 3.2757 1.6529 9.5053 3.1224 3.9584 4.2917 1.4311 6.0065 1.1157 2.6418 2.2245 1.4288 1.7948 1.6079 1.5408 1.2059 2.6621 3.1304 2.0697 1.5961 2.4972 1.8250 1.9576 2.9093 2.3353 1.2241 1.9577 1.4237 2.0638 2.0436 2.9507 1.3459 1.9627 1.8464 1.7711 1.8153 1.4071 1.3080 1.2142 1.2235 2.1558 1.2034 2.5187 1.2109 3.3396 1.1471 1.0551 1.0507 1.0782 1.0741 1.4406 1.5673 1.0594 2.7826 1.5906 5.8649 3.2807 3.7132 1.0838 1.0580 1.0446 1.0377 1.0363 1.0982 1.0983 1.0995 1.0960 1.0976 1.0997 1.0993 1.0876 1.0626 1.0961 1.0922 1.0743 1.0754 1.0463 1.0664 1.1039
irintensity: 1.5037 0.8146 3.5565 14.3343 5.2868 1.9083 2.1186 0.7201 1.6952 0.7568 7.7086 6.9112 1.2147 2.6519 5.6696 1.4744 7.2987 60.4053 69.1146 61.8810 1.4846 12.4675 0.0845 4.2571 10.6499 5.8712 33.1763 10.1132 211.0422 1.1530 27.9389 9.8455 7.5228 2.6053 50.7268 6.3620 63.8721 36.8660 8.1619 8.5279 2.3960 59.2431 18.0230 145.0946 15.8165 3.2602 8.8797 0.0523 5.7164 10.4070 0.1793 14.3129 9.0006 5.2594 24.5033 41.0183 34.0318 16.3164 115.7400 74.7323 43.5554 35.8567 60.4569 34.6298 49.6224 31.9347 66.9823 7.8160 48.5237 8.7263 134.9151 54.2835 35.2096 34.0592 25.1338 58.2683 16.2541 61.4567 23.7885 210.7441 29.1770 0.8821 1.1912 10.2024 9.1830 39.2518 80.1940 14.9871 552.3438 99.5648 8.4374 17.8042 264.0683 72.3053 14.9158 52.1549 48.1693 9.2303 5.7174 46.2722 18.9364 34.5891 28.8041 20.7848 82.6335 21.6481 268.9481 17.1270 3.8808 0.3834 41.2365 57.2028 46.6462 37.9655
temp: 298.150 k
press: 1.00000 atm
elementType: 8 8 8 7 7 7 6 6 6 6 6 6 6 6 6 6 6 6 6 1 1 1 1 1 1 1 1 1 1 1 1 1 1 1 1 1 1 1 1 1
symmnumber: 1
zpe: 871289.5 jmol-1
zpe.correction: 0.331857 hartree
zpe.thermalcorrener: 0.352654 hartree
zpe.thermalcorrenthalpy: 0.353598 hartree
zpe.thermalcorrgfe: 0.280858 hartree
zpe.sumelectzpe: -896.458414 hartree
zpe.sumelectthermal: -896.437617 hartree
zpe.sumelectthermalent: -896.436672 hartree
zpe.sumelectthermalfe: -896.509412 hartree
dipole: -2.2733 -0.8733 3.5334
dipole: 4.2913
quadrupole: -71.5241 -98.9352 -125.2513
quadrupole: -4.4412 0.0098 -5.7926
quadrupole: 27.0461 -0.3650 -26.6811 -4.4412 0.0098 -5.7926
hfenergy: -896.7902704 hartree
pointgroup: C01 [X(C13H21N3O3)]
dipole: 0.9060875 0.4789775 1.3416531 debye
polarizability: 225.9198216|-1.1532355|203.2887757|10.7429303|-3.4454155|111.8695137 unknown
InChI: InChI=1S/C13H21N3O3/c1-13(2,3)15-7-11(18)8-4-5-10(17)9(6-8)16-12(14)19/h4-6,11,15-18H,7,14H2,1-3H3
charge 0 multiplicity 1
40 atoms
O  -1.472993 0.770089 -1.93533
O  4.435619 0.919375 0.539536
O  1.151156 -2.762542 0.061996
N  -3.364772 0.687184 -0.109649
N  2.961249 -1.241623 0.160218
N  3.330122 -3.549127 0.288944
C  -4.0668 -0.542389 0.406053
C  -2.027071 1.038833 0.428517
C  -1.131694 1.559544 -0.755316
C  -5.459236 -0.557804 -0.271144
C  -3.274059 -1.804363 -0.015908
C  -4.23699 -0.504768 1.952019
C  0.348213 1.434004 -0.435967
C  0.92327 0.143588 -0.322366
C  1.14403 2.580784 -0.221882
C  2.284774 -0.00619 0.016869
C  2.514856 2.446719 0.105967
C  3.073482 1.163934 0.223593
C  2.391905 -2.52116 0.159842
H  -4.004992 1.493735 -0.108933
H  -2.055091 1.792508 1.241932
H  -1.560706 0.126659 0.835122
H  -1.37188 2.632815 -0.936997
H  -5.354152 -0.576635 -1.370569
H  -6.032118 -1.448672 0.041216
H  -6.049984 0.337293 0.007196
H  -2.26644 -1.8423 0.434476
H  -3.15276 -1.837892 -1.112732
H  -3.814534 -2.712657 0.306746
H  -4.82248 0.3817 2.262684
H  -4.765633 -1.407461 2.310518
H  -3.256123 -0.466741 2.460161
H  0.32388 -0.747713 -0.516775
H  0.70491 3.579684 -0.324093
H  -2.43377 0.503144 -1.733005
H  3.138699 3.336179 0.262984
H  3.96301 -1.141196 0.34572
H  4.932554 1.764902 0.649031
H  2.964267 -4.497443 0.301508
H  4.337583 -3.405495 0.29832
