program: Gaussian 09
title: 000036970
version: EM64L-G09RevD.01
frameworkgroup: C1[X(C11H12F6O2S)]
method: RPBEPBE
basis: SDD
operation: Freq
keyword: #p
keyword: freq=noraman
keyword: PBEPBE/SDD
title: #p freq=noraman PBEPBE/SDD
converged: YES YES NO NO
title: Mulliken charges:
elementType: S F F F F F F O O C C C C C C C C C C C H H H H H H H H H H H H
charge: 0.336354 -0.158725 -0.120539 -0.146554 -0.153136 -0.114761 -0.152955 -0.389337 -0.404965 -0.147980 -0.033684 -0.155692 -0.391065 0.376728 0.375380 -0.338691 -0.718121 -0.249132 -0.137633 -0.493115 0.231362 0.289109 0.256659 0.234462 0.210101 0.216843 0.231970 0.393947 0.343377 0.280564 0.256797 0.272431
chargesum: 0.00000
title: Mulliken charges with hydrogens summed into heavy atoms:
elementType: S F F F F F F O O C C C C C C C C C C C
charge: 0.336354 -0.158725 -0.120539 -0.146554 -0.153136 -0.114761 -0.152955 0.004610 -0.061588 0.083382 -0.033684 0.133417 0.100056 0.376728 0.375380 -0.338691 -0.059207 0.031431 0.119165 -0.220684
polarizability: 1.65132477e+02 -2.18931312e+01 1.29983073e+02 3.08238194e+00 1.94364372e+00 1.30201539e+02
1716.lowfreq: -4.0236 -0.0015 -0.0010 -0.0008 5.9504 12.3704 32.3585 43.8324 52.0279
frequency: 32.1592 43.7861 51.9959 57.5704 70.0978 88.5484 93.2115 136.8269 147.1601 172.6077 179.0897 194.5152 205.1717 242.4103 256.1915 270.8465 286.5652 293.5633 301.1114 307.2847 313.7536 328.6215 362.2484 370.1239 383.8859 429.6201 457.1244 464.0977 478.5029 490.9408 526.2407 569.7318 572.8943 606.8971 614.9036 638.1612 682.2899 694.4528 715.4601 745.4958 768.5251 820.2787 843.3274 847.5668 907.4587 919.6164 946.3522 956.1164 976.9786 989.4418 1023.2322 1031.9340 1046.1109 1058.4254 1069.0411 1079.9838 1089.1575 1114.9972 1123.8472 1138.1578 1148.8879 1159.5047 1211.2630 1237.5995 1257.3035 1303.3887 1317.4256 1341.6035 1357.7273 1365.6296 1380.2089 1387.0912 1390.3613 1464.4104 1470.2966 1476.2706 1485.0540 1527.3294 2983.1059 3001.4769 3034.6804 3072.5801 3072.9233 3086.1719 3108.5275 3162.9919 3189.4880 3237.7723 3357.3468 3543.9488
redmass: 9.6071 8.3420 5.9407 12.0093 14.7278 3.2442 5.6576 10.1260 3.3480 2.7533 2.4994 6.0250 4.3347 7.5500 3.5832 6.3761 5.0457 7.7931 2.4624 10.8100 1.6359 2.7910 4.8661 1.4662 5.1311 9.6709 4.4550 14.6779 9.8520 10.9952 4.0227 5.7673 7.5403 5.3769 7.8312 10.6651 5.4595 5.5574 1.1765 4.0866 1.4665 4.0704 1.5603 3.4330 2.7309 1.4098 3.5874 5.8731 3.3558 5.9812 5.1657 3.1105 3.9432 8.3391 2.8433 1.5059 3.7634 2.3724 2.1618 2.3452 4.5129 4.3615 1.4686 1.4088 1.2872 1.3189 1.2196 2.0217 1.2517 1.4482 1.1724 1.2515 1.2974 7.0856 1.0491 1.0764 1.0483 4.9930 1.0369 1.0818 1.0638 1.0890 1.0928 1.0987 1.1009 1.0923 1.0952 1.1006 1.0674 1.0663
irintensity: 0.4951 0.1706 0.4856 0.1708 0.0319 0.3842 1.8327 2.0130 0.6348 2.3467 3.0832 3.1188 2.7009 1.1300 0.4219 2.9488 10.6803 6.5900 15.3910 4.7708 84.7466 36.9467 20.9189 117.4518 6.2022 3.3314 24.3601 4.7586 1.7589 0.8928 4.1469 1.0335 2.9263 27.9547 21.1981 15.4163 3.6520 2.3000 106.1687 11.4543 34.0375 10.1647 22.5452 84.5793 55.7461 5.1544 24.8556 57.7095 71.4313 20.2158 11.7193 65.2199 57.9255 327.9592 27.8427 28.9716 88.3158 0.2014 50.1060 25.3576 240.1434 149.2815 19.6344 38.3368 15.0586 14.7952 1.1944 3.2309 5.6375 5.2704 25.9031 5.6481 10.9428 13.1497 5.0036 16.8256 13.4184 1.2765 29.2500 5.8347 8.6024 9.4651 18.0829 26.8047 24.2908 3.3736 2.2673 0.5994 454.9955 9.9772
temp: 298.150 k
press: 1.00000 atm
elementType: 16 9 9 9 9 9 9 8 8 6 6 6 6 6 6 6 6 6 6 6 1 1 1 1 1 1 1 1 1 1 1 1
symmnumber: 1
zpe: 572766.5 jmol-1
zpe.correction: 0.218155 hartree
zpe.thermalcorrener: 0.238950 hartree
zpe.thermalcorrenthalpy: 0.239894 hartree
zpe.thermalcorrgfe: 0.168476 hartree
zpe.sumelectzpe: -1572.351138 hartree
zpe.sumelectthermal: -1572.330343 hartree
zpe.sumelectthermalent: -1572.329399 hartree
zpe.sumelectthermalfe: -1572.400817 hartree
dipole: 4.8463 1.2570 -3.0491
dipole: 5.8620
quadrupole: -116.4032 -127.9370 -124.5243
quadrupole: -10.4551 -3.6595 -2.6231
quadrupole: 6.5516 -4.9821 -1.5695 -10.4551 -3.6595 -2.6231
hfenergy: -1572.5692931 hartree
pointgroup: C01 [X(C11H12F6O2S1)]
dipole: -1.8926162 -0.7715765 -1.0684959 debye
polarizability: 162.9530298|-23.0118143|130.6085457|5.3246409|-2.6798107|131.7555133 unknown
InChI: InChI=1S/C11H12F6O2S/c1-2-6(8(18)7-4-3-5-20-7)9(19,10(12,13)14)11(15,16)17/h3-6,8,18-19H,2H2,1H3
charge 0 multiplicity 1
32 atoms
S  -3.536092 0.70188 0.901938
F  1.022244 0.682205 -2.369803
F  2.721782 1.648893 -1.220644
F  2.68923 -0.593362 -1.529489
F  3.120322 -0.139146 1.242398
F  2.215879 1.894085 1.577311
F  1.221496 0.078238 2.471165
O  0.142705 1.552052 0.07978
O  -1.697177 -2.226314 1.068952
C  0.226349 -0.997643 -0.019846
C  1.002297 0.383643 0.04424
C  -1.150367 -0.892446 0.738357
C  1.054558 -2.234848 0.45673
C  1.881103 0.531485 -1.249608
C  1.892739 0.560843 1.323315
C  -2.190985 -0.089913 -0.018662
C  0.802949 -3.486456 -0.411166
C  -2.40639 0.036891 -1.394988
C  -3.602864 0.764271 -1.736898
C  -4.319915 1.188906 -0.629465
H  0.009005 -1.155978 -1.0948
H  -0.969926 -0.450917 1.732393
H  0.803796 -2.452003 1.50943
H  2.132674 -2.011727 0.416119
H  -0.255078 -3.799057 -0.382932
H  1.090756 -3.305482 -1.464153
H  1.406724 -4.334676 -0.041509
H  -0.756434 1.318753 -0.292592
H  -2.155204 -2.589072 0.267145
H  -1.728742 -0.365883 -2.152758
H  -3.910026 0.970391 -2.764399
H  -5.242806 1.765387 -0.59306
