program: Gaussian 09
title: 000036937
version: EM64L-G09RevD.01
frameworkgroup: C1[X(C9H11NO2)]
method: RPBEPBE
basis: SDD
operation: Freq
keyword: #p
keyword: freq=noraman
keyword: PBEPBE/SDD
title: #p freq=noraman PBEPBE/SDD
converged: YES YES NO NO
title: Mulliken charges:
elementType: O O N C C C C C C C C C H H H H H H H H H H H
charge: -0.409386 -0.408852 -0.310809 -0.492144 0.344209 0.319126 -0.434083 -0.525320 -0.550319 -0.538495 0.167337 0.160820 0.233158 0.203717 0.216526 0.189858 0.193519 0.229616 0.267601 0.222883 0.218929 0.351169 0.350939
chargesum: 0.00000
title: Mulliken charges with hydrogens summed into heavy atoms:
elementType: O O N C C C C C C C C C
charge: -0.058217 -0.057913 -0.043208 -0.055268 0.344209 0.319126 -0.027698 -0.102185 -0.327437 -0.319566 0.167337 0.160820
polarizability: 1.47170648e+02 8.53186958e-01 1.21885063e+02 -2.67145693e-01 -7.50782835e-01 5.93410606e+01
1716.lowfreq: -17.0095 -10.0453 -0.0008 -0.0006 -0.0001 4.9832 84.9186 100.4259 190.5393
frequency: 84.8165 100.3784 190.5363 235.8967 254.0694 292.2896 308.8166 331.7789 339.8786 379.4831 389.5762 407.4346 433.3186 469.2453 528.6783 577.6580 628.1163 649.6792 707.5974 720.5802 748.1103 793.0395 830.0723 844.5745 902.6045 930.9566 982.3019 990.6919 1064.0404 1074.0098 1136.8977 1141.6832 1160.0405 1182.5587 1197.2842 1204.5497 1237.5616 1251.9783 1283.4160 1299.5650 1315.2451 1335.5374 1379.9723 1406.4355 1420.5662 1442.1307 1447.3674 1465.3798 1476.0054 1526.7606 1618.8772 1628.1273 2820.2398 2860.1992 2974.7402 3004.8928 3029.3798 3044.4294 3092.7918 3097.3942 3472.4237 3574.1242 3577.1732
redmass: 3.3096 3.6872 2.8828 4.2609 4.4837 5.5933 1.9899 1.1116 1.1703 3.3721 5.3541 4.5999 2.8962 2.3331 3.7275 2.7268 5.2173 3.2960 3.4075 3.4089 2.7932 4.0530 1.4874 1.4460 2.3841 2.2807 2.8462 1.7922 1.9799 2.6753 1.9813 1.4309 2.3641 1.0881 1.4470 1.3604 1.7231 1.2428 1.6111 1.9975 1.7905 1.6419 1.6381 5.0287 4.2944 1.1346 1.2926 1.0933 1.1199 3.3695 7.3360 6.3053 1.0715 1.0714 1.0595 1.0858 1.1001 1.0905 1.0903 1.0910 1.0754 1.0658 1.0662
irintensity: 0.7072 0.2995 6.0136 0.7294 0.9816 18.7623 0.8673 7.8625 199.6605 84.8763 0.4634 6.2307 10.2098 48.1211 11.2619 61.7030 0.7144 48.8947 0.9040 5.8208 24.1881 8.9526 7.7395 36.1857 2.9333 16.6303 7.5339 4.4736 10.8935 99.2579 41.5392 429.5025 12.7016 0.1828 2.4833 1.4883 10.5136 7.8217 6.8072 27.2158 35.0744 17.2740 14.5522 1.9675 31.6322 7.8816 1.5612 3.6735 11.0023 107.2143 17.3422 12.1494 101.6233 127.7146 35.8420 34.5785 32.9983 58.4150 31.9597 8.1975 0.9884 29.9144 36.3810
temp: 298.150 k
press: 1.00000 atm
elementType: 8 8 7 6 6 6 6 6 6 6 6 6 1 1 1 1 1 1 1 1 1 1 1
symmnumber: 1
zpe: 486257.8 jmol-1
zpe.correction: 0.185206 hartree
zpe.thermalcorrener: 0.195830 hartree
zpe.thermalcorrenthalpy: 0.196774 hartree
zpe.thermalcorrgfe: 0.149649 hartree
zpe.sumelectzpe: -553.839895 hartree
zpe.sumelectthermal: -553.829271 hartree
zpe.sumelectthermalent: -553.828327 hartree
zpe.sumelectthermalfe: -553.875453 hartree
dipole: 2.8711 -0.2907 0.8747
dipole: 3.0154
quadrupole: -74.7552 -51.7472 -75.5950
quadrupole: -1.2738 2.8218 -0.5883
quadrupole: -7.3894 15.6186 -8.2292 -1.2738 2.8218 -0.5883
hfenergy: -554.0251013 hartree
pointgroup: C01 [X(C9H11N1O2)]
dipole: 1.1273853 0.1091161 -0.3529213 debye
dipolederiv: -1.1060812 -0.6037049 0.0253181 -0.6802823 -0.4052401 -0.0037823 0.0157116 -0.0089104 -0.3980402 -1.0941959 0.6112184 -0.0175287 0.6936648 -0.4189475 0.0022226 -0.0211926 0.0036964 -0.3980206 -0.3807597 0.1007201 -0.0784856 0.0852082 -0.4598957 -0.0232418 -0.1752886 -0.0839258 -0.6462602 -0.000716 -0.052848 0.0128018 -0.0048381 0.0789611 0.0338778 -0.0162379 0.0788829 0.1449345 0.0704094 -0.0188671 0.0269848 -0.3094074 0.0370255 0.0047258 0.1625294 -0.0094977 -0.0578675 0.0017081 0.0206138 -0.0201468 0.2990933 0.0296089 -0.0029151 -0.08501 -0.0156962 -0.0654874 0.2058913 0.0431404 0.0345411 0.0142113 0.3721905 0.1335081 -0.0542064 0.0761685 0.4601605 0.4120287 -0.1712152 0.0576172 -0.1562009 0.2419054 -0.1135741 0.0696555 -0.0533116 0.4269617 -0.2076968 -0.1148018 0.0111088 0.0872391 0.0472057 -0.0157365 -0.0235651 -0.0235155 -0.2018393 -0.1736261 0.1182749 0.002358 -0.0885021 0.0459697 -0.0166286 0.0041869 -0.005327 -0.2022361 0.8867236 0.540408 -0.0123769 0.9251638 0.3287346 -0.0026827 -0.0274502 0.0033096 0.0408951 0.8706137 -0.5488842 0.0147157 -0.9324453 0.3451759 -0.0087113 0.0335109 -0.0106277 0.039662 -0.0302518 0.0637666 -0.0262472 0.0479023 0.0419124 0.0551531 -0.0561194 0.104213 -0.1029799 0.0113131 -0.0318178 -0.0165472 0.0119541 -0.127138 -0.0972352 0.0301683 -0.141758 0.0158048 -0.1805713 0.114283 -0.0173047 0.0986789 0.0027157 -0.0034269 -0.0632374 0.007934 0.0707109 0.0622288 -0.0273796 -0.0435065 -0.0264211 -0.0311685 0.0376481 0.0750426 -0.0702518 -0.3106172 -0.1120735 -0.0096767 0.0145958 0.0024525 -0.0479107 0.0939861 -0.0014981 0.2078077 -0.2115899 0.0068551 0.028644 0.0193299 0.0065391 -0.1132342 -0.089271 -0.0314816 -0.1265745 0.0025887 -0.0099233 -0.0578707 0.0176366 -0.0693315 0.0522552 -0.0205688 0.1709779 0.0419351 0.3220822 0.0647114 -0.0221221 0.0017109 -0.0431829 -0.1305881 0.0101847 0.0035976 0.0036679 0.1597526 0.066362 0.0207401 -0.0021164 0.0408551 -0.1338102 0.0092183 -0.0094462 0.0053799 0.1595261 0.3209313 0.1821988 -0.0088916 0.1325345 0.1210031 0.0103078 -0.0051876 0.011001 0.3757797 0.316119 -0.18482 0.0044332 -0.1348854 0.1232694 0.006942 0.0045404 0.0054001 0.3760793 unknown
polarizability: 147.1663288|-0.9149531|121.8726892|-0.3407329|-1.2501015|59.3577533 unknown
InChI: InChI=1S/C9H11NO2/c11-8-3-6-1-2-10-5-7(6)4-9(8)12/h3-4,10-12H,1-2,5H2
charge 0 multiplicity 1
23 atoms
O  -3.114697 -1.342728 0.022849
O  -3.099405 1.369128 -0.053531
N  3.068859 0.643327 0.319749
C  1.914086 -1.504641 0.081696
C  0.60937 -0.717488 0.030862
C  0.613783 0.698647 -0.012538
C  3.103912 -0.649191 -0.397445
C  1.9204 1.48555 -0.066797
C  -0.635859 -1.396987 0.042209
C  -0.619932 1.394974 -0.04588
C  -1.862632 -0.704846 0.013714
C  -1.854767 0.717024 -0.030525
H  2.112734 -1.822424 1.124154
H  1.833739 -2.42192 -0.534076
H  4.056394 -1.158848 -0.165864
H  3.046612 -0.525894 -1.508722
H  2.025287 1.906976 -1.101772
H  1.865148 2.347454 0.625611
H  3.959391 1.152271 0.279821
H  -0.6434 -2.496032 0.072833
H  -0.615961 2.494193 -0.079078
H  -2.992929 -2.324111 0.063521
H  -2.966833 2.349567 -0.080489
