program: Gaussian 09
title: 000036951
version: EM64L-G09RevD.01
frameworkgroup: C1[X(C9H12F6O2)]
method: RPBEPBE
basis: SDD
operation: Freq
keyword: #p
keyword: freq=noraman
keyword: PBEPBE/SDD
title: #p freq=noraman PBEPBE/SDD
converged: NO YES NO NO
title: Mulliken charges:
elementType: F F F F F F O O C C C C C C C C C H H H H H H H H H H H H
charge: -0.147919 -0.123073 -0.157993 -0.154981 -0.160238 -0.126327 -0.393508 -0.434748 0.013308 -0.550007 -0.117883 0.390386 0.385214 -0.414201 0.384066 -0.778176 -0.773981 0.275377 0.257447 0.233462 0.291772 0.356556 0.342100 0.228962 0.233338 0.238654 0.229195 0.235870 0.237329
chargesum: 0.00000
title: Mulliken charges with hydrogens summed into heavy atoms:
elementType: F F F F F F O O C C C C C C C C C
charge: -0.147919 -0.123073 -0.157993 -0.154981 -0.160238 -0.126327 -0.036953 -0.092648 0.013308 -0.017184 0.115578 0.390386 0.385214 -0.122428 0.384066 -0.077222 -0.071588
polarizability: 1.29351301e+02 -6.75135075e+00 9.85426701e+01 1.10644507e+01 -6.43487591e+00 1.04749887e+02
1716.lowfreq: -7.4438 -5.1469 -0.0006 0.0004 0.0004 7.5142 20.5485 41.6646 52.1612
frequency: 20.3195 41.6235 52.1220 61.0598 74.9671 89.9521 106.3611 147.4027 152.4609 174.4009 189.2708 226.6873 235.7226 259.1427 275.9462 281.4929 291.2787 299.6644 320.1260 332.9145 374.6966 413.2864 426.6207 454.0593 460.0194 467.9568 485.1847 495.1944 525.3356 555.4550 575.8053 612.4692 638.8597 696.4070 805.7389 850.6570 873.7829 884.5535 947.6329 959.1848 967.4075 984.5701 1001.7128 1006.6119 1035.9407 1049.3813 1066.6144 1084.5170 1085.0365 1100.3876 1108.7074 1154.7445 1162.1120 1193.7228 1232.2487 1260.5110 1301.4380 1345.1673 1351.0431 1389.0012 1393.0077 1398.8764 1405.0254 1452.0559 1455.0950 1460.2913 1470.3045 1472.5841 1674.8319 2971.5023 2979.5439 3020.0583 3025.0891 3046.9953 3051.8622 3088.0782 3090.4939 3095.5506 3112.4692 3219.2580 3531.4699
redmass: 7.7910 6.9148 2.9329 7.7326 1.7008 1.8287 7.4898 4.0779 10.7681 1.3710 3.5672 4.4320 5.8430 10.0497 9.3624 4.7543 1.5194 4.5125 8.7908 3.6316 3.2584 6.9017 2.9436 2.6140 13.2548 8.7938 7.0083 3.6460 2.8740 3.7155 1.4849 7.9692 10.9990 6.3547 3.0411 5.9902 2.1875 1.7949 1.4722 3.1207 3.7871 6.9212 1.3451 5.6829 2.0727 6.5941 6.7865 2.5794 3.2974 1.8331 3.1640 5.9078 3.8025 1.6899 1.6801 1.6487 1.1780 1.3924 1.2640 1.5235 1.3136 1.4892 1.2111 1.0511 1.0834 1.0553 1.0467 1.0966 6.0117 1.0374 1.0392 1.0631 1.0817 1.0969 1.0962 1.1009 1.0980 1.0912 1.0970 1.0683 1.0661
irintensity: 0.1774 0.4957 0.6118 0.7346 0.1443 0.3718 1.2597 4.8010 2.8077 0.8565 0.3720 0.9781 6.4136 1.6972 4.5274 6.1439 106.2332 29.4669 0.7691 6.0973 1.4548 1.9007 10.5095 5.9811 4.0502 2.7354 4.5784 9.6748 28.0720 22.5479 49.8688 15.8537 23.8574 5.9868 9.2254 56.8454 1.8674 18.7864 10.4925 90.5666 58.8926 62.2266 18.6714 77.8747 172.2237 144.8421 105.5324 114.1113 90.1917 18.9399 9.2526 195.9154 220.1353 14.5555 30.7576 7.3550 1.8399 2.3860 8.3006 10.0033 33.0929 8.2429 17.6308 2.1885 22.3079 11.8447 35.0676 16.2822 47.6258 19.2584 23.1181 5.0106 22.0579 2.4435 26.0422 2.7494 8.9960 22.8078 23.7809 608.9467 8.9492
temp: 298.150 k
press: 1.00000 atm
elementType: 9 9 9 9 9 9 8 8 6 6 6 6 6 6 6 6 6 1 1 1 1 1 1 1 1 1 1 1 1
symmnumber: 1
zpe: 534917.0 jmol-1
zpe.correction: 0.203739 hartree
zpe.thermalcorrener: 0.222701 hartree
zpe.thermalcorrenthalpy: 0.223645 hartree
zpe.thermalcorrgfe: 0.155728 hartree
zpe.sumelectzpe: -1098.283237 hartree
zpe.sumelectthermal: -1098.264275 hartree
zpe.sumelectthermalent: -1098.263331 hartree
zpe.sumelectthermalfe: -1098.331248 hartree
dipole: -4.3418 -0.0471 1.2991
dipole: 4.5323
quadrupole: -98.9223 -103.3304 -96.4942
quadrupole: -5.1564 8.7849 0.1883
quadrupole: 0.6600 -3.7481 3.0881 -5.1564 8.7849 0.1883
hfenergy: -1098.486976 hartree
pointgroup: C01 [X(C9H12F6O2)]
dipole: -1.7156459 -0.1764594 0.4527339 debye
polarizability: 129.0651563|-9.7936783|103.0044369|8.831007|-7.178426|100.574265 unknown
InChI: InChI=1S/C9H12F6O2/c1-5(2)3-6(16)4-7(17,8(10,11)12)9(13,14)15/h3,6,16-17H,4H2,1-2H3
charge 0 multiplicity 1
29 atoms
F  2.213164 -1.759742 -1.326099
F  2.972402 0.353295 -1.504808
F  3.166873 -0.751294 0.468596
F  1.431421 0.892274 2.069648
F  -0.178979 1.903045 0.839918
F  1.995118 2.162836 0.283232
O  0.238978 0.369346 -1.396205
O  -1.804438 -2.164362 1.614913
C  0.909374 -0.034561 -0.18366
C  0.192483 -1.187826 0.578158
C  -1.303714 -0.942894 0.938754
C  2.317287 -0.529343 -0.646337
C  1.06397 1.227966 0.743457
C  -2.175964 -0.789725 -0.290383
C  -3.095859 0.191449 -0.549216
C  -3.936616 0.134916 -1.81323
C  -3.370336 1.386133 0.343382
H  0.228101 -2.083298 -0.066996
H  0.761382 -1.412643 1.499062
H  -1.400824 -0.074542 1.616735
H  -2.113474 -1.645062 -0.979752
H  -0.749259 0.207824 -1.275795
H  -1.294617 -2.301422 2.45608
H  -3.831217 1.065711 -2.403387
H  -5.009473 0.044808 -1.553874
H  -3.666669 -0.719227 -2.456748
H  -4.452307 1.438027 0.570756
H  -2.819223 1.363997 1.295109
H  -3.109282 2.328415 -0.176008
