program: Gaussian 09
title: 000036960
version: EM64L-G09RevD.01
frameworkgroup: C1[X(C12H11ClF6O2)]
method: RPBEPBE
basis: SDD
operation: Freq
keyword: #p
keyword: freq=noraman
keyword: PBEPBE/SDD
title: #p freq=noraman PBEPBE/SDD
converged: YES YES NO NO
title: Mulliken charges:
elementType: Cl F F F F F F O O C C C C C C C C C C C C H H H H H H H H H H H
charge: -0.037709 -0.159252 -0.155894 -0.125283 -0.154946 -0.151876 -0.117395 -0.409992 -0.531736 -0.193354 0.025111 -0.244717 -0.739381 0.364595 0.364784 0.492093 -0.436466 -0.358882 -0.200849 -0.210978 -0.117859 0.283314 0.266973 0.241071 0.236914 0.258164 0.397043 0.380921 0.247376 0.265429 0.261483 0.261299
chargesum: 0.00000
title: Mulliken charges with hydrogens summed into heavy atoms:
elementType: Cl F F F F F F O O C C C C C C C C C C C C
charge: -0.037709 -0.159252 -0.155894 -0.125283 -0.154946 -0.151876 -0.117395 -0.012949 -0.150815 0.089959 0.025111 0.022256 -0.003232 0.364595 0.364784 0.492093 -0.189090 -0.093453 0.060634 0.050321 -0.117859
polarizability: 2.08506376e+02 8.45104662e+00 1.15224066e+02 -1.21529832e+01 1.26781698e+01 1.19463855e+02
1716.lowfreq: -4.9317 -0.4935 0.0003 0.0011 0.0013 5.6509 32.7615 37.9679 43.1339
frequency: 32.7220 37.9443 42.9942 61.3819 78.0141 89.6720 128.5873 132.5706 160.0181 166.7849 196.6413 211.6054 216.8610 244.2732 267.0978 286.7627 294.1975 298.7042 306.6117 326.0241 332.2654 339.3069 388.6696 408.5466 414.6508 432.2298 442.5068 463.5067 479.2144 488.8339 503.0682 538.8567 577.2654 599.8966 619.7719 626.4475 658.6155 691.8997 726.9107 757.5333 806.0416 832.9195 837.1908 876.9214 888.1304 930.8189 951.3057 963.9632 971.9427 980.8370 1001.6232 1006.3645 1031.9785 1050.7424 1061.1917 1073.2656 1081.7628 1101.5118 1111.1972 1135.7501 1162.8055 1170.6031 1184.9914 1202.0408 1240.2530 1282.8880 1296.6677 1314.1775 1321.5169 1365.4615 1385.6827 1404.4045 1417.1305 1477.4612 1483.0990 1486.3223 1490.5651 1587.5881 1600.7385 3005.4848 3018.2495 3022.8180 3108.8407 3110.4251 3126.1548 3131.5475 3146.3099 3172.4134 3175.3004 3604.5900
redmass: 9.1654 9.2326 4.8004 8.4686 11.8457 5.5306 9.2861 6.9864 4.0328 4.5943 3.1511 6.5644 2.5525 9.2802 9.2276 7.5501 8.6457 8.2458 6.4511 2.5487 1.5511 4.6261 7.1874 3.0773 4.9255 5.7205 7.6505 17.4360 9.9527 7.2376 5.3598 4.0526 7.7152 4.8539 10.4701 8.1628 11.9774 5.5253 3.6287 1.1222 4.6557 1.4758 1.3344 5.2299 2.1912 3.9918 1.7701 2.0011 1.3697 8.1943 4.0627 5.8529 9.1474 9.4021 2.4385 2.8280 5.3261 2.4603 1.4280 2.9210 4.8161 4.4044 1.1342 2.1177 1.6932 1.4244 1.3616 1.4083 1.3708 1.4290 5.3082 2.0613 1.1982 2.1939 1.2088 1.0886 1.0892 7.1556 6.1907 1.0836 1.0392 1.0823 1.0777 1.0887 1.0992 1.0905 1.0890 1.0954 1.0963 1.0668
irintensity: 1.0264 1.1344 0.6864 0.7071 0.7590 0.7044 1.2293 1.9336 0.4173 0.7456 1.5393 0.3231 2.1255 1.0807 0.5251 0.5497 0.8233 0.7399 7.9008 54.9996 75.0249 4.3111 0.1488 0.6940 5.0047 24.3544 26.2989 2.5599 3.2323 8.5423 23.4305 13.9848 15.6396 13.2106 16.3018 9.2868 7.1605 5.2764 5.1687 106.9104 13.4362 54.9952 21.6050 68.3246 57.9306 102.0812 32.2614 23.4568 0.1710 75.1975 32.7382 41.7131 102.2700 326.8537 73.8131 46.5649 99.1373 25.6799 11.5468 61.9485 112.9167 304.3670 3.2925 9.1598 32.1637 16.4383 21.4020 0.5125 1.7708 3.8481 2.0300 16.9342 6.5128 29.2024 81.4499 54.3090 54.1603 2.3329 26.8218 5.6788 11.3773 12.3044 346.8093 266.8963 19.2830 8.0627 2.0403 3.2368 0.2033 24.7374
temp: 298.150 k
press: 1.00000 atm
elementType: 17 9 9 9 9 9 9 8 8 6 6 6 6 6 6 6 6 6 6 6 6 1 1 1 1 1 1 1 1 1 1 1
symmnumber: 1
zpe: 563808.7 jmol-1
zpe.correction: 0.214743 hartree
zpe.thermalcorrener: 0.235243 hartree
zpe.thermalcorrenthalpy: 0.236187 hartree
zpe.thermalcorrgfe: 0.165051 hartree
zpe.sumelectzpe: -1671.843679 hartree
zpe.sumelectthermal: -1671.823180 hartree
zpe.sumelectthermalent: -1671.822236 hartree
zpe.sumelectthermalfe: -1671.893371 hartree
dipole: 5.1492 -1.7932 0.3376
dipole: 5.4629
quadrupole: -154.6549 -125.2091 -124.8958
quadrupole: -1.5058 3.6830 -0.1672
quadrupole: -19.7349 9.7108 10.0241 -1.5058 3.6830 -0.1672
hfenergy: -1672.0584224 hartree
pointgroup: C01 [X(C12H11Cl1F6O2)]
dipole: 2.0573712 -0.5840479 0.2132596 debye
polarizability: 207.6171053|11.5353834|118.989181|-13.484616|12.1851851|116.5880104 unknown
InChI: InChI=1S/C12H11ClF6O2/c1-6(9(20)7-2-4-8(13)5-3-7)10(21,11(14,15)16)12(17,18)19/h2-6,9,20-21H,1H3
charge 0 multiplicity 1
32 atoms
Cl 6.439286 0.783044 -0.405168
F  -1.89523 -2.328137 0.650826
F  -2.068439 -1.682928 -1.506876
F  -3.844643 -1.487092 -0.12082
F  -3.19956 0.956413 -1.707398
F  -2.367878 2.467761 -0.229066
F  -4.173593 1.234852 0.311833
O  -2.18813 0.189391 1.69584
O  0.227718 -0.63185 1.975645
C  -0.473345 0.418551 -0.103571
C  -1.976467 0.097304 0.270655
C  0.516059 -0.620612 0.509486
C  -0.173764 0.628241 -1.607648
C  -2.454962 -1.331711 -0.188913
C  -2.938926 1.177709 -0.330034
C  1.978607 -0.271436 0.279553
C  2.781602 -1.068587 -0.570926
C  2.558729 0.850355 0.925952
C  4.141558 -0.753505 -0.790064
C  3.915548 1.177486 0.721933
C  4.686953 0.369043 -0.138399
H  -0.287594 1.377069 0.419956
H  0.308899 -1.625568 0.092232
H  0.856677 1.003486 -1.720098
H  -0.269115 -0.302587 -2.189541
H  -0.847106 1.376529 -2.052258
H  -1.336992 -0.160592 2.127654
H  0.752094 -1.335666 2.428315
H  2.349207 -1.94257 -1.072611
H  1.953781 1.460393 1.605433
H  4.76188 -1.368205 -1.44814
H  4.366344 2.040015 1.221018
