program: Gaussian 09
title: 000036957
version: EM64L-G09RevD.01
frameworkgroup: C1[X(C12H12Cl2F4O2)]
method: RPBEPBE
basis: SDD
operation: Freq
keyword: #p
keyword: freq=noraman
keyword: PBEPBE/SDD
title: #p freq=noraman PBEPBE/SDD
converged: YES YES NO NO
title: Mulliken charges:
elementType: Cl Cl F F F F O O C C C C C C C C C C C C H H H H H H H H H H H H
charge: 0.051062 0.095284 -0.104146 -0.125273 -0.148689 -0.123608 -0.417658 -0.516856 -0.151038 0.244375 -0.279653 -0.743034 -0.010114 -0.004054 0.453301 -0.436466 -0.370515 -0.221679 -0.229036 -0.233143 0.268468 0.276755 0.235754 0.241442 0.263796 0.396404 0.377504 0.244972 0.263156 0.233801 0.233181 0.235707
chargesum: 0.00000
title: Mulliken charges with hydrogens summed into heavy atoms:
elementType: Cl Cl F F F F O O C C C C C C C C C C C C
charge: 0.051062 0.095284 -0.104146 -0.125273 -0.148689 -0.123608 -0.021254 -0.139352 0.117430 0.244375 -0.002898 -0.002041 -0.010114 -0.004054 0.453301 -0.191494 -0.107359 0.012122 0.004144 0.002564
polarizability: 1.96657951e+02 -5.31999914e+00 1.49548410e+02 -1.82505248e+01 -4.58847120e+00 1.12622986e+02
1716.lowfreq: -12.0460 -8.7245 -5.6242 -0.0028 -0.0026 -0.0022 26.4601 37.0973 48.3316
frequency: 26.2042 37.0266 48.3186 58.0838 71.4620 80.3367 128.9193 159.5000 174.1777 194.4157 204.4516 218.0153 226.5331 249.5664 268.9266 275.2110 284.0656 298.5123 307.7167 363.5231 369.1255 376.6595 384.9054 389.5334 403.5259 416.3213 438.1875 472.4172 508.7554 529.1901 549.7944 569.6640 602.9731 615.0595 641.3787 706.7431 729.6591 762.9407 774.0413 832.4062 834.5245 858.4821 882.4743 914.7105 933.5695 938.4907 958.3961 982.1676 988.2293 990.1815 1002.5226 1009.3052 1026.1564 1036.3521 1042.9765 1075.2427 1087.6397 1106.6483 1111.7643 1146.4801 1175.5771 1187.8837 1195.0514 1230.0011 1281.7608 1292.9224 1310.2155 1341.8130 1373.0618 1388.1044 1406.6288 1444.4107 1482.9027 1483.5885 1486.1588 1511.5497 1594.4440 1613.5744 2998.8402 3016.8968 3024.7689 3035.1922 3108.3284 3123.4136 3130.0752 3134.2341 3141.3315 3152.7552 3168.3177 3589.8834
redmass: 6.9476 4.5645 10.4610 10.0853 5.6734 8.8673 12.5410 8.9339 5.5382 5.7031 1.9182 13.3031 1.9562 12.6336 6.3764 5.5598 5.3840 12.4145 5.5692 7.7868 11.3885 10.2334 2.0634 2.7917 2.7677 4.4855 3.5732 5.5726 6.2718 5.9216 7.7844 4.6056 8.4044 6.4232 5.9940 1.7563 4.1002 1.4972 1.8145 3.5305 3.7996 1.2557 2.6063 2.9777 1.8263 5.5405 3.5583 1.3932 11.0042 6.3591 1.3391 3.1180 2.1837 4.1139 5.2162 2.0767 2.3047 3.3454 4.7829 2.3193 1.0608 1.1186 1.9669 1.6070 1.3206 1.6306 1.3107 1.3109 1.2942 5.7438 1.1858 2.1187 1.7152 1.1798 1.0912 1.1839 6.0123 6.0523 1.0828 1.0386 1.0769 1.0776 1.1001 1.0876 1.0867 1.0984 1.0915 1.0962 1.1015 1.0665
irintensity: 0.5551 0.1943 0.3032 0.7951 1.1110 0.6703 1.2347 0.5345 0.1596 3.0088 0.0711 1.3547 0.2231 0.9178 2.5583 0.5731 5.4593 1.7498 1.3000 6.3138 3.3168 10.9941 44.4623 33.5213 1.3791 39.0185 34.9458 21.5642 4.9433 1.9837 28.2283 31.6726 13.4226 0.3420 11.1917 56.0694 76.0562 117.3225 70.2128 137.9162 148.2648 1.5401 32.1694 22.0091 13.0036 32.1255 64.2333 0.3305 116.7469 9.0087 2.8636 142.6525 13.1723 149.7630 20.3647 45.4825 94.7377 109.8559 23.5436 24.1351 0.2148 1.0307 8.5465 22.6611 13.2497 24.6164 0.7782 3.4259 6.8522 1.3870 10.0817 14.2178 2.1351 13.6115 10.7590 165.6763 0.9587 0.6336 0.2873 18.3279 331.5734 440.5291 16.9899 6.1054 0.0162 9.5240 9.3175 25.9531 18.8391 16.3846
temp: 298.150 k
press: 1.00000 atm
elementType: 17 17 9 9 9 9 8 8 6 6 6 6 6 6 6 6 6 6 6 6 1 1 1 1 1 1 1 1 1 1 1 1
symmnumber: 1
zpe: 580776.5 jmol-1
zpe.correction: 0.221206 hartree
zpe.thermalcorrener: 0.241197 hartree
zpe.thermalcorrenthalpy: 0.242141 hartree
zpe.thermalcorrgfe: 0.171923 hartree
zpe.sumelectzpe: -1932.874923 hartree
zpe.sumelectthermal: -1932.854932 hartree
zpe.sumelectthermalent: -1932.853988 hartree
zpe.sumelectthermalfe: -1932.924206 hartree
dipole: -7.1405 -0.0972 -1.0050
dipole: 7.2116
quadrupole: -123.3334 -128.7608 -129.1566
quadrupole: -0.2285 1.0563 0.0505
quadrupole: 3.7502 -1.6772 -2.0730 -0.2285 1.0563 0.0505
hfenergy: -1933.0961291 hartree
pointgroup: C01 [X(C12H12Cl2F4O2)]
dipole: 2.8203869 0.0816768 -0.2978698 debye
polarizability: 195.2442223|-12.2903636|144.145485|18.0082637|13.6589506|119.4396392 unknown
InChI: InChI=1S/C12H12Cl2F4O2/c1-7(9(19)8-5-3-2-4-6-8)10(20,11(13,15)16)12(14,17)18/h2-7,9,19-20H,1H3
charge 0 multiplicity 1
32 atoms
Cl -2.210341 -2.64498 -1.198061
Cl -3.694796 2.053085 -0.279171
F  -3.961682 -0.956426 -0.136335
F  -2.449346 -1.802222 1.309431
F  -1.210851 2.239637 0.567356
F  -2.567827 0.945337 1.846772
O  -1.793476 0.316046 -1.653699
O  0.671281 -0.116059 -2.080296
C  -0.182903 -0.377836 0.177042
C  -1.669816 -0.01365 -0.262445
C  0.873373 0.391158 -0.678239
C  0.115338 -0.23466 1.690868
C  -2.598904 -1.267145 0.002236
C  -2.233834 1.244795 0.501397
C  2.311725 0.139842 -0.257669
C  3.0715 1.172117 0.343818
C  2.908569 -1.130354 -0.470116
C  4.407963 0.938714 0.739456
C  4.244914 -1.362036 -0.079895
C  4.997352 -0.328953 0.528676
H  -0.057582 -1.444874 -0.096392
H  0.655063 1.47561 -0.660968
H  0.161104 0.820214 2.008024
H  1.08959 -0.700758 1.910502
H  -0.6480 -0.742797 2.297481
H  -0.917283 0.087736 -2.122903
H  1.352943 0.273427 -2.681414
H  2.617297 2.157245 0.506712
H  2.327782 -1.925638 -0.951085
H  4.987966 1.742538 1.205591
H  4.700551 -2.343851 -0.249339
H  6.034528 -0.509761 0.831567
