program: Gaussian 09
title: 000036934
version: EM64L-G09RevD.01
frameworkgroup: C1[X(C12H4Cl4O2)]
method: RPBEPBE
basis: SDD
operation: Freq
keyword: #p
keyword: freq=noraman
keyword: PBEPBE/SDD
title: #p freq=noraman PBEPBE/SDD
converged: NO NO NO NO
title: Mulliken charges:
elementType: Cl Cl Cl Cl O O C C C C C C C C C C C C H H H H
charge: 0.040062 0.011104 0.010183 0.007092 -0.256794 -0.269699 0.272102 0.264942 0.404345 0.261049 -0.343363 -0.342444 -0.277039 -0.377623 -0.088578 -0.087618 -0.137072 -0.210321 0.293332 0.289458 0.271124 0.265758
chargesum: 0.00000
title: Mulliken charges with hydrogens summed into heavy atoms:
elementType: Cl Cl Cl Cl O O C C C C C C C C C C C C
charge: 0.040062 0.011104 0.010183 0.007092 -0.256794 -0.269699 0.272102 0.264942 0.404345 0.261049 -0.050031 -0.052986 -0.277039 -0.106499 -0.088578 -0.087618 -0.137072 0.055437
polarizability: 3.13363980e+02 -4.93230761e+00 1.81228600e+02 1.05184072e-03 -6.57474429e-04 6.10592426e+01
1716.lowfreq: -5.7652 -4.1440 0.0013 0.0021 0.0022 9.6837 23.8676 48.9903 94.1646
frequency: 23.7971 48.9860 94.1628 103.0339 129.6539 147.2040 175.6968 186.9655 204.7702 228.2646 255.9512 266.3463 321.6353 322.2763 365.2256 385.6143 409.2281 442.7119 458.5894 501.2192 516.3798 531.7678 544.1344 581.4095 590.1086 623.0682 659.1356 670.3932 690.8906 728.2098 764.7899 801.0243 845.4401 858.9639 871.7058 886.7630 928.8756 928.8888 1099.1646 1101.7696 1110.0351 1136.8660 1179.4815 1221.5381 1225.7086 1280.1210 1350.9468 1355.0888 1369.9857 1407.5795 1438.6218 1468.8360 1561.5719 1576.9844 1588.9882 1628.2864 3167.4969 3174.7895 3176.9293 3185.2181
redmass: 17.9800 16.7667 11.0958 18.9900 10.2478 10.8702 28.9248 30.1139 17.3892 6.7827 18.2448 7.2402 13.7250 7.6741 12.2310 16.1113 13.1488 3.1026 7.5035 7.2449 4.6386 8.2973 5.8815 10.9994 11.3663 10.1244 4.1532 8.1079 7.3647 7.3183 7.7410 1.3399 1.4195 7.4906 1.3809 8.7540 10.2287 1.3220 1.8081 2.8011 8.5065 2.4984 1.8956 1.5692 2.2956 4.1606 8.8500 8.8572 6.9383 5.2509 3.5532 4.0409 9.4519 8.0596 9.9116 8.6953 1.0888 1.0923 1.0932 1.0974
irintensity: 0.0383 0.2259 0.4601 0.1335 0.0007 1.2903 0.0187 0.0546 0.0825 0.6247 0.1902 0.8914 0.2330 0.5036 2.7815 7.7731 1.0420 9.4215 13.3955 3.1383 0.8815 1.5596 5.4215 7.3825 0.2170 0.5697 0.0107 14.7396 0.1522 4.7918 19.7439 53.1048 0.4355 128.7683 56.0561 109.0604 51.4299 0.7020 105.6850 6.2567 30.3454 7.8217 14.1592 3.8041 4.6066 307.1644 56.3723 26.6389 8.5010 54.8613 637.9224 370.4634 20.7833 2.6807 2.7452 0.9010 0.7186 3.4800 1.4414 0.1356
temp: 298.150 k
press: 1.00000 atm
elementType: 17 17 17 17 8 8 6 6 6 6 6 6 6 6 6 6 6 6 1 1 1 1
symmnumber: 1
zpe: 328370.7 jmol-1
zpe.correction: 0.125070 hartree
zpe.thermalcorrener: 0.140423 hartree
zpe.thermalcorrenthalpy: 0.141367 hartree
zpe.thermalcorrgfe: 0.080635 hartree
zpe.sumelectzpe: -2449.089837 hartree
zpe.sumelectthermal: -2449.074484 hartree
zpe.sumelectthermalent: -2449.073540 hartree
zpe.sumelectthermalfe: -2449.134271 hartree
dipole: 0.9062 -2.4015 -0.0001
dipole: 2.5667
quadrupole: -141.4230 -121.7955 -131.9662
quadrupole: -6.7897 -0.0006 0.0002
quadrupole: -9.6948 9.9327 -0.2380 -6.7897 -0.0006 0.0002
hfenergy: -2449.2149066 hartree
pointgroup: C01 [X(C12H4Cl4O2)]
dipole: 0.4017385 0.926484 0.0000287 debye
dipolederiv: -0.0211653 0.0441998 0.0000011 0.153723 -0.5853914 0.0000119 -0.0000069 0.0000255 0.0066739 -0.5356027 -0.3027081 0.0000185 -0.4134556 -0.3113013 0.0000139 0.0000284 0.0000152 -0.0172222 -0.6940659 0.2438255 0.0000427 0.3231843 -0.1739256 -0.0000211 0.0000522 -0.0000191 -0.0180323 -0.7664234 0.1809199 -0.0000544 0.2495292 -0.1145816 0.0000174 -0.0001121 0.0000282 -0.0204839 -2.1574777 -0.1084799 0.00001 -0.2064861 -0.2895073 -0.0000189 0.0000129 -0.0000525 -0.1315356 -2.1844709 -0.0926535 0.0000093 -0.2240511 -0.3936293 0.0000243 0.0000244 0.0000371 -0.1443822 1.4435533 -0.0802462 -0.0000643 -0.8301515 0.0632879 0.0000152 -0.0000993 0.0000199 0.0708131 1.1826992 0.2304219 -0.000049 1.1156686 0.2383986 -0.0000286 -0.0000583 -0.0000257 0.0755391 1.1179231 0.2320701 0.000051 1.1410293 -0.0303656 0.0000197 0.000091 0.000043 0.121375 1.4246582 -0.0690677 0.0000273 -0.8562004 0.0958811 -0.0000084 0.0000142 -0.0000049 0.0667323 -0.371804 -0.0919392 0.0000018 -0.1260249 -0.0834273 0.000011 0.0000093 0.0000061 -0.0935442 -0.4312151 0.033831 0.0000106 0.0546324 -0.0393855 -0.000009 0.0000202 -0.0000047 -0.099873 -0.3164494 -0.1163739 -0.0000159 -0.1494686 0.9069964 -0.0000107 -0.0000367 -0.0000339 -0.0751811 -0.1953117 0.0145002 0.0000169 -0.036228 0.0329146 -0.0000013 0.0000096 -0.000002 -0.1607341 0.5523741 0.581947 -0.0000205 0.688223 0.4233692 -0.0000276 -0.0000357 -0.0000324 -0.0662906 0.8514137 -0.5007446 -0.0000711 -0.586432 0.1704603 0.0000377 -0.0000851 0.0000377 -0.065029 1.0525592 -0.2006029 0.0001033 -0.4272092 -0.0105203 -0.0000366 0.0001938 -0.0000306 -0.0581729 -0.2458551 -0.0006239 -0.0000129 0.1324513 -0.0392287 0.0000201 -0.0000277 0.0000042 -0.1031469 0.0955307 0.029848 0.0000068 0.0235203 0.0503979 -0.0000022 0.000008 -0.0000005 0.180858 0.1025035 -0.0161793 0.0000069 -0.0091136 0.0356646 -0.0000012 0.0000101 -0.0000021 0.1813938 0.0881626 0.041845 -0.0000078 0.0287143 0.001338 -0.0000001 0.0000028 -0.0000026 0.1808471 0.0084637 -0.0537894 -0.0000104 -0.0458548 0.0525553 -0.0000054 -0.000015 -0.0000058 0.1693956 unknown
polarizability: 313.5316045|-1.4664571|181.0609761|-0.0010824|-0.0006059|61.0592426 unknown
InChI: InChI=1S/C12H4Cl4O2/c13-5-1-2-8-12(11(5)16)18-10-4-7(15)6(14)3-9(10)17-8/h1-4H
charge 0 multiplicity 1
22 atoms
Cl 2.861137 -2.627795 0.000008
Cl -4.816558 -1.978154 0.000111
Cl -5.21514 1.288703 0.000213
Cl 5.484935 -0.652968 0.000203
O  0.291942 -1.168358 -0.000263
O  -0.057279 1.72553 -0.000208
C  -0.989843 -0.56764 -0.000132
C  -1.160614 0.840443 -0.00011
C  1.39221 -0.282111 -0.00014
C  1.226977 1.127333 -0.000147
C  -2.104407 -1.415031 -0.000063
C  -2.446953 1.394478 -0.000012
C  2.688342 -0.838758 -0.000063
C  2.34327 1.976019 -0.000069
C  -3.403246 -0.860346 0.000036
C  -3.574281 0.543731 0.000074
C  3.813652 0.021858 -0.000003
C  3.64099 1.421648 0.000011
H  -1.955798 -2.49834 -0.000084
H  -2.564453 2.481634 0.000003
H  2.191401 3.058701 -0.000063
H  4.518617 2.073422 0.000095
