program: Gaussian 09
title: 000036964
version: EM64L-G09RevD.01
frameworkgroup: C1[X(C12H11BrF6O2)]
method: RPBEPBE
basis: SDD
operation: Freq
keyword: #p
keyword: freq=noraman
keyword: PBEPBE/SDD
title: #p freq=noraman PBEPBE/SDD
converged: YES YES NO NO
title: Mulliken charges:
elementType: Br F F F F F F O O C C C C C C C C C C C C H H H H H H H H H H H
charge: 0.031779 -0.158794 -0.156080 -0.125299 -0.154825 -0.151878 -0.117347 -0.409929 -0.531802 -0.193429 0.024955 -0.243140 -0.739569 0.364642 0.364555 0.485681 -0.436820 -0.362055 -0.174535 -0.183472 -0.226166 0.283392 0.266611 0.241664 0.237069 0.258238 0.397162 0.381023 0.248518 0.266530 0.256930 0.256391
chargesum: 0.00000
title: Mulliken charges with hydrogens summed into heavy atoms:
elementType: Br F F F F F F O O C C C C C C C C C C C C
charge: 0.031779 -0.158794 -0.156080 -0.125299 -0.154825 -0.151878 -0.117347 -0.012767 -0.150779 0.089963 0.024955 0.023471 -0.002598 0.364642 0.364555 0.485681 -0.188302 -0.095525 0.082394 0.072919 -0.226166
polarizability: 2.29050212e+02 9.20281563e+00 1.15590301e+02 -1.21545209e+01 1.29794763e+01 1.21131377e+02
1716.lowfreq: -0.0004 0.0004 0.0004 0.1319 4.2132 6.9715 29.6018 33.0495 40.8918
frequency: 29.5857 33.0276 40.7940 59.3509 77.8695 86.4455 117.9062 125.9684 154.3719 156.4603 180.6358 204.2627 211.5636 243.5284 260.1612 279.7674 284.9148 294.5697 302.6546 324.1970 328.7208 333.2583 348.7631 404.8749 413.8633 421.1439 441.7361 463.5157 474.7617 488.1893 503.1011 536.1543 577.5014 595.4498 618.4616 625.2704 655.0600 682.9134 728.2106 756.3396 805.2840 835.2252 839.7588 877.1821 888.1204 931.8468 953.0257 966.1550 975.7897 981.0037 997.8402 1006.0462 1031.9321 1050.7033 1059.9695 1061.2237 1081.7350 1101.3955 1112.9224 1135.3571 1162.9703 1170.6466 1188.1125 1202.3610 1240.2432 1283.5191 1296.6438 1314.2108 1320.5227 1363.9610 1381.6906 1401.8812 1416.9398 1472.6404 1483.2877 1485.1146 1489.8126 1581.9355 1597.0645 3005.7933 3018.8167 3022.9428 3110.1314 3114.8584 3127.2552 3130.6594 3144.7125 3171.0955 3173.9972 3604.5820
redmass: 9.7382 10.0958 4.4988 7.5147 11.0718 5.6083 11.0823 5.7151 6.2732 3.1689 4.0969 3.2166 3.8744 8.7281 7.3867 6.9431 7.2202 9.4967 11.6590 3.3133 3.6348 1.5202 6.0617 3.0128 4.4919 5.6404 7.6112 17.1788 9.4300 7.5039 5.5012 4.1226 7.3488 4.8191 10.0433 8.2807 12.1241 5.5058 3.6095 1.1193 4.6804 1.5270 1.2932 5.1928 2.1892 3.8898 2.0326 1.7718 1.3741 8.1911 4.7667 5.9196 9.0861 9.2689 2.6028 2.4724 5.2907 2.5465 1.4392 2.8552 4.9530 4.5364 1.1237 2.1022 1.6930 1.4230 1.3497 1.4354 1.3683 1.4475 5.0099 1.9881 1.1941 2.3328 1.1442 1.0505 1.1461 7.0177 6.0931 1.0834 1.0395 1.0821 1.0985 1.0682 1.0989 1.0906 1.0891 1.0953 1.0963 1.0668
irintensity: 0.9933 1.0712 0.7697 0.6738 0.6298 0.3665 1.0341 0.8143 1.1916 0.5199 3.2370 1.7689 0.7931 1.1225 0.3041 0.2650 0.6259 1.1328 1.4093 64.7844 5.0626 74.7570 1.0431 1.9506 2.6786 27.2237 21.1074 2.7235 2.2323 7.6342 23.1791 10.5940 18.0790 15.6067 14.3341 11.3058 8.0645 3.7499 3.9148 108.8601 16.8922 61.4911 11.1568 68.7299 59.2030 112.3764 39.3957 14.4157 0.2390 75.0774 47.5795 43.3798 102.4998 327.6350 96.4350 14.7736 99.0521 27.8935 7.6300 57.6524 115.4383 313.6944 1.3402 8.2797 30.5410 17.9907 20.5580 0.3742 1.6842 3.7231 2.5415 19.7695 6.5700 42.9110 70.5515 11.1368 101.0118 1.4799 32.3606 5.3202 11.5301 12.6383 6.2240 608.6790 23.8648 7.8118 1.7564 5.0167 0.1395 25.1592
temp: 298.150 k
press: 1.00000 atm
elementType: 35 9 9 9 9 9 9 8 8 6 6 6 6 6 6 6 6 6 6 6 6 1 1 1 1 1 1 1 1 1 1 1
symmnumber: 1
zpe: 562461.6 jmol-1
zpe.correction: 0.214230 hartree
zpe.thermalcorrener: 0.234992 hartree
zpe.thermalcorrenthalpy: 0.235936 hartree
zpe.thermalcorrgfe: 0.163363 hartree
zpe.sumelectzpe: -1225.242923 hartree
zpe.sumelectthermal: -1225.222161 hartree
zpe.sumelectthermalent: -1225.221217 hartree
zpe.sumelectthermalfe: -1225.293791 hartree
dipole: 5.1833 -1.9035 0.3709
dipole: 5.5342
quadrupole: -161.9585 -127.8324 -127.5463
quadrupole: 0.4964 2.8463 -0.2981
quadrupole: -22.8461 11.2800 11.5661 0.4964 2.8463 -0.2981
hfenergy: -1225.4571536 hartree
pointgroup: C01 [X(C12H11Br1F6O2)]
dipole: 2.0886827 -0.5771352 0.2123472 debye
polarizability: 226.973957|15.2968421|120.7648558|-15.9514212|12.0352104|118.0330776 unknown
InChI: InChI=1S/C12H11BrF6O2/c1-6(9(20)7-2-4-8(13)5-3-7)10(21,11(14,15)16)12(17,18)19/h2-6,9,20-21H,1H3
charge 0 multiplicity 1
32 atoms
Br 6.574385 0.80117 -0.421233
F  -1.908031 -2.327243 0.644459
F  -2.074103 -1.676433 -1.512098
F  -3.853864 -1.480839 -0.130353
F  -3.203021 0.96485 -1.708098
F  -2.369804 2.471037 -0.225008
F  -4.178987 1.240427 0.310471
O  -2.199053 0.187678 1.694897
O  0.216787 -0.639281 1.9766
C  -0.479504 0.418393 -0.100531
C  -1.984001 0.098878 0.269936
C  0.506614 -0.624712 0.511584
C  -0.177214 0.631628 -1.603535
C  -2.463575 -1.328044 -0.193962
C  -2.943595 1.182396 -0.329925
C  1.97032 -0.278105 0.283723
C  2.771306 -1.072643 -0.57037
C  2.554182 0.838539 0.934402
C  4.132236 -0.760037 -0.788688
C  3.912013 1.163249 0.730981
C  4.686083 0.358908 -0.133783
H  -0.292547 1.375068 0.425995
H  0.298075 -1.628078 0.091052
H  0.854933 1.002937 -1.713574
H  -0.275847 -0.296856 -2.188546
H  -0.846786 1.38429 -2.046348
H  -1.349765 -0.164283 2.127931
H  0.742699 -1.341855 2.429387
H  2.337121 -1.943371 -1.076282
H  1.951616 1.447337 1.617216
H  4.745818 -1.377134 -1.450757
H  4.359808 2.023529 1.236457
