program: Gaussian 09
title: 000036946
version: EM64L-G09RevD.01
frameworkgroup: C1[X(C9H10ClF5O2)]
method: RPBEPBE
basis: SDD
operation: Freq
keyword: #p
keyword: freq=noraman
keyword: PBEPBE/SDD
title: #p freq=noraman PBEPBE/SDD
converged: YES YES NO NO
title: Mulliken charges:
elementType: Cl F F F F F O O C C C C C C C C C H H H H H H H H H H
charge: 0.027730 -0.092852 -0.131176 -0.157388 -0.145203 -0.122722 -0.411924 -0.297461 0.135177 -0.618032 0.035903 0.367842 0.283853 -0.416142 0.447824 -0.803188 -0.763080 0.269580 0.290917 0.386994 0.236484 0.244644 0.247721 0.239642 0.221218 0.259810 0.263831
chargesum: 0.00000
title: Mulliken charges with hydrogens summed into heavy atoms:
elementType: Cl F F F F F O O C C C C C C C C C
charge: 0.027730 -0.092852 -0.131176 -0.157388 -0.145203 -0.122722 -0.024930 -0.297461 0.135177 -0.057535 0.035903 0.367842 0.283853 -0.179659 0.447824 -0.071181 -0.018222
polarizability: 1.58976807e+02 -6.58263712e+00 1.00493794e+02 4.92131204e-01 -1.72235322e+01 1.03924032e+02
1716.lowfreq: -6.5122 -0.0023 -0.0020 -0.0013 4.2913 8.4181 24.3804 28.3019 36.2686
frequency: 24.1998 27.8546 36.0713 56.5242 90.4859 114.3225 133.0769 141.4216 153.0566 172.8629 192.0041 205.8451 232.4916 252.7046 271.8245 284.8942 303.0493 319.0432 324.2496 370.5985 375.6754 402.7853 414.5512 428.2223 461.8181 475.0600 512.3518 552.6033 576.3059 619.6447 656.2433 734.4487 777.6545 815.5707 828.2668 849.6457 863.8016 904.6988 940.6747 950.8299 982.0840 993.4456 1023.1911 1034.7603 1041.3835 1067.5171 1080.1052 1081.2863 1129.9606 1151.1714 1171.4899 1220.7737 1265.2246 1325.7702 1376.8960 1387.1274 1394.0865 1435.6229 1441.8102 1445.5165 1451.2844 1454.3151 1469.1165 1556.1520 1622.0066 2969.3126 2974.7405 2987.3031 3008.0096 3042.2616 3063.8433 3097.5038 3097.6883 3102.6940 3128.2300
redmass: 6.1217 5.0728 3.8829 7.6634 3.4498 3.3137 2.5866 4.4024 2.2789 7.4297 1.7891 2.6043 9.3211 5.6929 9.1564 9.8114 11.1672 5.9930 5.0249 18.4535 9.0576 4.4227 5.9815 4.1960 5.9212 2.8075 11.0990 6.5861 3.8758 8.1625 6.3797 4.1952 1.2186 3.9218 2.6288 2.0245 3.2946 5.8584 3.9641 1.2428 1.4635 4.0951 5.1495 6.5240 2.1993 8.6658 1.9372 3.6312 7.3902 1.8689 4.5360 2.8850 1.5541 1.6966 1.3518 1.4441 1.1956 1.0974 1.5984 1.0473 1.1510 1.0533 1.1238 3.0552 5.7657 1.0381 1.0696 1.0372 1.0648 1.0952 1.0936 1.0986 1.0986 1.1004 1.0904
irintensity: 0.6502 0.1978 0.0361 0.1083 0.2326 0.7131 1.4309 0.8939 0.6405 1.3811 4.3918 1.2965 1.3270 0.8029 3.1416 1.3598 0.2650 12.4169 3.5959 0.8675 3.8863 28.9895 9.0534 10.4525 7.2446 1.2085 7.4337 9.1478 4.1492 46.9745 35.6066 39.1499 79.7611 15.3644 38.2253 14.2354 74.2228 13.5038 142.9080 4.8678 25.4159 116.9094 32.6682 190.5609 25.1664 85.3323 37.2333 46.6833 109.1975 129.9149 255.3402 20.4424 42.5574 56.4079 8.1820 38.3608 20.5472 36.2186 320.9616 11.9785 103.3949 28.1250 15.1869 69.1154 245.5590 17.4214 771.0375 1.3874 10.1146 9.0953 3.7087 8.7218 5.1012 36.2714 9.6791
temp: 298.150 k
press: 1.00000 atm
elementType: 17 9 9 9 9 9 8 8 6 6 6 6 6 6 6 6 6 1 1 1 1 1 1 1 1 1 1
symmnumber: 1
zpe: 472053.1 jmol-1
zpe.correction: 0.179796 hartree
zpe.thermalcorrener: 0.198276 hartree
zpe.thermalcorrenthalpy: 0.199220 hartree
zpe.thermalcorrgfe: 0.131554 hartree
zpe.sumelectzpe: -1457.337281 hartree
zpe.sumelectthermal: -1457.318800 hartree
zpe.sumelectthermalent: -1457.317856 hartree
zpe.sumelectthermalfe: -1457.385522 hartree
dipole: -7.5969 0.7904 -3.1709
dipole: 8.2699
quadrupole: -90.9483 -109.3994 -106.7327
quadrupole: 0.4596 1.8869 -0.1691
quadrupole: 11.4119 -7.0393 -4.3726 0.4596 1.8869 -0.1691
hfenergy: -1457.5170765 hartree
pointgroup: C01[X(C9H10Cl1F5O2)]
dipole: -3.0216382 0.4556244 1.1172538 debye
polarizability: 159.2329045|4.9826456|85.5333302|-2.9096935|-4.6328982|118.6283988 unknown
InChI: InChI=1S/C9H10ClF5O2/c1-5(2)3-6(16)4-7(17,8(10,11)12)9(13,14)15/h3,17H,4H2,1-2H3
charge 0 multiplicity 1
27 atoms
Cl 1.540987 -1.747309 1.982015
F  2.395454 -2.074079 -0.517704
F  0.149686 -1.997726 -0.265489
F  2.764163 1.022009 1.557906
F  2.572304 2.210577 -0.352607
F  3.785603 0.301506 -0.333004
O  1.257979 0.199806 -1.67961
O  -1.327374 0.411675 -1.472484
C  1.312725 0.13251 -0.24488
C  0.101248 0.829801 0.453481
C  1.370247 -1.39502 0.145976
C  2.619087 0.894411 0.152277
C  -1.255539 0.493084 -0.189713
C  -2.402563 0.332999 0.696677
C  -3.698257 0.07355 0.289693
C  -4.792329 -0.087635 1.318761
C  -4.109607 -0.076607 -1.156342
H  0.099646 0.616649 1.53361
H  0.245198 1.92135 0.330186
H  0.270342 0.286499 -1.935637
H  -2.197528 0.415095 1.770947
H  -5.596947 0.653083 1.14194
H  -5.265941 -1.083927 1.216444
H  -4.429454 0.024972 2.353282
H  -5.1946 -0.250333 -1.249808
H  -3.823573 0.812681 -1.746899
H  -3.562456 -0.910323 -1.634518
