program: Gaussian 09
title: 000036933
version: EM64L-G09RevD.01
frameworkgroup: C1[X(C17H21BrN2)]
method: RPBEPBE
basis: SDD
operation: Freq
keyword: #p
keyword: freq=noraman
keyword: PBEPBE/SDD
title: #p freq=noraman PBEPBE/SDD
converged: YES YES NO NO
title: Mulliken charges:
elementType: Br N N C C C C C C C C C C C C C C C C C H H H H H H H H H H H H H H H H H H H H H
charge: -0.012877 -0.433786 -0.015181 0.138474 -0.477623 -0.435266 -0.411249 -0.466779 -0.095255 0.251704 0.280610 -0.312588 -0.115992 -0.108873 -0.274566 -0.316019 -0.688240 -0.695978 -0.296582 -0.201091 0.233555 0.204335 0.207550 0.205989 0.201505 0.214016 0.243172 0.231048 0.288724 0.207769 0.210583 0.194060 0.216254 0.268250 0.219298 0.208342 0.235205 0.222031 0.208140 0.215682 0.251650
chargesum: 0.00000
title: Mulliken charges with hydrogens summed into heavy atoms:
elementType: Br N N C C C C C C C C C C C C C C C C C
charge: -0.012877 -0.145062 -0.015181 0.138474 -0.039732 -0.021727 0.004272 0.007441 -0.095255 0.251704 0.280610 0.105764 -0.115992 0.085187 -0.058312 -0.047769 -0.025396 -0.050125 -0.296582 0.050560
polarizability: 3.17924519e+02 -6.80212132e+00 2.39442348e+02 -2.55014988e+00 -2.01609707e+01 1.23303285e+02
1716.lowfreq: -13.4419 -3.5040 -0.0004 -0.0002 0.0001 6.1135 15.2054 30.8061 37.5679
frequency: 10.8114 30.7305 37.4208 61.1609 78.2118 102.4538 120.4927 136.4497 173.8683 180.5131 189.3022 215.5647 224.5410 236.0964 273.3616 285.7073 302.8339 329.1362 349.0338 372.4651 392.1701 409.7213 429.4370 436.1549 453.5797 498.2788 502.2645 514.1792 553.0622 600.2443 609.9297 637.7366 649.2630 679.6938 694.9076 770.1820 813.0765 823.4038 829.2371 834.7139 856.3878 864.7860 889.5922 908.2386 914.5195 921.1609 932.0253 945.9104 962.0433 973.7573 986.5513 1027.2786 1065.1048 1079.1880 1095.2287 1119.6064 1125.7309 1132.0232 1140.6572 1153.8741 1163.9256 1179.8469 1183.5422 1232.7778 1239.3593 1250.8597 1258.2240 1276.9860 1280.5504 1305.3004 1324.8515 1330.0626 1337.7611 1340.3231 1350.0688 1353.2902 1379.2549 1388.9978 1392.8462 1398.4487 1401.3998 1419.7600 1448.9165 1454.8633 1464.2151 1466.2293 1467.8007 1471.7605 1477.1149 1481.5025 1482.1456 1487.0328 1503.1875 1539.9792 1566.5722 1600.8733 2940.2411 2951.9789 2960.9660 2971.9328 2975.6759 2977.1211 2979.5846 2980.5168 3017.3956 3038.1445 3041.7614 3050.7873 3054.5964 3063.5856 3071.4156 3075.9658 3079.8836 3144.1016 3155.2780 3177.0908 3536.5265
redmass: 2.7132 4.0568 4.1106 3.8930 2.8839 2.6884 4.8521 3.8164 3.8787 2.9616 1.2804 1.9711 3.5290 1.5632 2.9182 3.6236 3.3104 2.2197 4.7873 2.4209 2.3645 4.1696 2.3966 3.8658 3.2608 1.3925 2.8117 3.9712 3.9256 3.9985 4.6108 4.2524 6.1593 4.6601 4.3303 2.5040 3.0196 3.5877 1.5695 1.7468 2.1026 2.7147 1.9630 1.6733 1.2633 1.8367 1.8897 1.7451 1.6269 1.3396 2.6820 3.8502 2.1683 1.8834 1.5659 1.7975 2.5638 1.1868 2.1182 2.0817 1.6705 1.9160 2.2850 2.2739 1.2728 1.2933 1.4146 1.4019 1.9928 1.5715 1.7904 1.4578 1.4725 1.4338 1.5162 1.5161 1.2134 3.8209 2.1071 1.8916 3.0562 3.2421 1.2327 1.5707 1.2678 1.1050 1.0669 1.0927 1.0982 1.0648 1.1102 1.0566 2.8364 5.7050 5.6086 6.8249 1.0832 1.0634 1.0661 1.0359 1.0367 1.0645 1.0614 1.0651 1.0944 1.0945 1.1002 1.1021 1.0972 1.0996 1.0983 1.1001 1.0990 1.0903 1.0879 1.0979 1.0746
irintensity: 0.2196 0.1072 0.3371 0.0914 0.1091 0.8241 0.5412 0.4072 2.4753 1.0122 0.5130 1.4463 2.9856 0.6244 0.9617 0.8714 0.7158 1.9829 5.6629 4.6793 2.2494 1.3284 1.9251 1.4966 2.3475 91.3989 3.3783 8.8023 17.6307 2.1746 11.1581 18.1118 13.1659 8.7249 2.4775 1.3420 1.8131 13.0197 10.2890 48.9582 5.8254 14.1292 5.9157 4.7236 8.1204 18.5856 17.6178 4.3985 1.6765 0.7572 8.0815 12.4822 20.4881 0.2606 0.1829 6.5157 30.3989 1.8267 3.6931 28.0537 3.4211 14.1633 2.6573 1.8257 7.5253 0.7464 3.7221 2.3768 0.2645 3.5646 6.2141 12.3399 3.4511 5.6973 12.1122 2.5829 8.7503 5.5610 94.6991 8.1487 73.8218 16.4328 26.3168 28.5611 22.4700 12.0472 13.9762 14.9490 4.1052 30.3381 30.7281 21.8207 250.1208 79.2286 74.7355 10.0338 28.1658 18.1352 83.6222 43.9265 20.2656 44.8703 32.3843 13.6994 24.7091 41.2129 61.6453 43.7388 20.9825 20.7311 68.3504 17.6271 63.4993 8.9490 0.1301 8.0478 12.3085
temp: 298.150 k
press: 1.00000 atm
elementType: 35 7 7 6 6 6 6 6 6 6 6 6 6 6 6 6 6 6 6 6 1 1 1 1 1 1 1 1 1 1 1 1 1 1 1 1 1 1 1 1 1
symmnumber: 1
zpe: 896482.9 jmol-1
zpe.correction: 0.341452 hartree
zpe.thermalcorrener: 0.360935 hartree
zpe.thermalcorrenthalpy: 0.361879 hartree
zpe.thermalcorrgfe: 0.291146 hartree
zpe.sumelectzpe: -781.914399 hartree
zpe.sumelectthermal: -781.894917 hartree
zpe.sumelectthermalent: -781.893973 hartree
zpe.sumelectthermalfe: -781.964706 hartree
dipole: 2.9920 3.5681 -0.5098
dipole: 4.6843
quadrupole: -126.6915 -123.2951 -132.0693
quadrupole: 3.7146 -0.7275 -0.8378
quadrupole: 0.6605 4.0569 -4.7173 3.7146 -0.7275 -0.8378
hfenergy: -782.2558516 hartree
pointgroup: C01 [X(C17H21Br1N2)]
dipole: 1.7297414 -0.6137061 0.1668684 debye
polarizability: 292.4165712|37.267993|264.9940689|7.8625776|-18.8035886|123.259512 unknown
InChI: InChI=1S/C17H21BrN2/c1-11(2)10-19-17-13-5-3-4-6-15(13)20-16-8-7-12(18)9-14(16)17/h7-9,11,19H,3-6,10H2,1-2H3
charge 0 multiplicity 1
41 atoms
Br -4.361259 -2.776939 0.390276
N  1.009463 -1.289928 0.821469
N  -0.951355 2.297573 -0.44873
C  1.112798 1.103522 0.194001
C  2.59194 1.214745 0.561682
C  3.050589 2.672058 0.783107
C  2.62647 3.536135 -0.422175
C  1.087696 3.59868 -0.497484
C  0.389651 2.263828 -0.256892
C  0.393852 -0.105965 0.395812
C  -1.04793 -0.100381 0.194496
C  2.289029 -1.847295 0.333657
C  -1.668606 1.141435 -0.207072
C  2.145837 -3.343315 -0.058139
C  -1.871485 -1.261877 0.356666
C  -3.089813 1.188171 -0.381231
C  1.247972 -3.525722 -1.303833
C  3.544494 -3.963336 -0.282293
C  -3.250008 -1.166358 0.172994
C  -3.884941 0.05631 -0.18948
H  2.776801 0.607717 1.469182
H  3.229807 0.780126 -0.235232
H  2.594904 3.080475 1.707381
H  4.148131 2.695564 0.921943
H  3.039166 3.091384 -1.350241
H  3.039517 4.559154 -0.34427
H  0.743126 3.990185 -1.472405
H  0.704547 4.310428 0.261105
H  0.399052 -1.978688 1.26405
H  3.087725 -1.751574 1.098249
H  2.608795 -1.277912 -0.557112
H  1.673705 -3.872019 0.800221
H  -1.43827 -2.236359 0.60275
H  -3.527792 2.147307 -0.673297
H  1.062875 -4.596432 -1.505555
H  1.736562 -3.093282 -2.19802
H  0.268837 -3.027334 -1.183627
H  3.461343 -5.030786 -0.555011
H  4.074128 -3.447999 -1.10659
H  4.172497 -3.890591 0.625208
H  -4.969454 0.098296 -0.322957
