program: Gaussian 09
title: 000036911
version: EM64L-G09RevD.01
frameworkgroup: C1[X(C8H10N2O2)]
method: RPBEPBE
basis: SDD
operation: Freq
keyword: #p
keyword: freq=noraman
keyword: PBEPBE/SDD
title: #p freq=noraman PBEPBE/SDD
converged: NO YES NO YES
title: Mulliken charges:
elementType: O O N N C C C C C C C C H H H H H H H H H H
charge: -0.230936 -0.230925 0.023667 -0.690586 0.436118 0.435537 0.020463 -0.650451 -0.650600 0.585145 -0.788006 -0.787915 0.232323 0.232381 0.254536 0.254535 0.204890 0.254556 0.254579 0.204771 0.317952 0.317966
chargesum: 0.00000
title: Mulliken charges with hydrogens summed into heavy atoms:
elementType: O O N N C C C C C C C C
charge: -0.230936 -0.230925 0.023667 -0.054669 0.436118 0.435537 0.020463 -0.418128 -0.418219 0.585145 -0.074044 -0.074009
polarizability: 1.77312221e+02 2.65143430e-02 1.31102182e+02 1.28495370e-02 -5.76693628e-03 5.28131006e+01
1716.lowfreq: -68.0128 -13.5285 -9.5018 -0.0008 -0.0007 -0.0005 8.3368 65.0855 181.5610
frequency: -68.0083 65.0697 181.5608 203.9443 253.8122 271.5448 278.1934 299.4018 331.4226 342.5386 362.3444 398.7368 419.5661 447.9023 519.1513 530.4365 556.4563 589.6183 591.1606 610.1559 673.4673 719.2275 773.8258 851.8489 869.2356 949.1306 978.2922 1037.0316 1039.9905 1041.4679 1048.0197 1065.3471 1085.7516 1200.2615 1211.7181 1253.9227 1338.2182 1355.6107 1379.3547 1403.8285 1404.8692 1435.8298 1452.9478 1453.1109 1461.0628 1484.3059 1489.6138 1572.1522 1630.2187 1648.8331 2995.1672 2995.7713 3088.8254 3089.1717 3090.8598 3091.9333 3126.2535 3130.2576 3557.4926 3696.8236
redmass: 7.7682 4.1998 3.3288 2.7463 5.4949 1.0540 1.0764 4.9384 3.3291 8.4573 2.8654 5.9233 1.0374 1.2475 4.8924 2.9247 4.8479 4.5402 3.4201 6.3295 3.4033 4.4119 9.3920 1.3070 1.8049 2.8964 2.4502 2.0036 1.5576 1.5446 1.7917 1.3827 6.6732 7.9996 1.8196 1.6858 4.7165 3.4760 4.0212 1.1965 1.3612 1.8797 1.0466 1.0467 1.7222 1.7003 1.5888 7.9963 3.6973 1.3129 1.0369 1.0368 1.0961 1.0961 1.1008 1.1006 1.0912 1.0920 1.0453 1.1040
irintensity: 0.0000 0.5869 11.1889 0.0000 0.2257 0.6362 0.0544 1.8811 4.9326 0.5048 1.4207 0.2307 0.0000 294.5870 0.0354 0.0000 0.3702 5.1411 0.9795 12.1077 9.4862 0.0316 8.5365 0.0000 53.3240 0.5061 2.1089 13.6838 24.7734 0.0008 1.7417 0.2794 1.1826 502.5542 34.0358 20.3354 136.3047 69.6130 0.3538 28.1045 36.6665 0.3096 1.2998 21.8073 0.0692 10.6965 33.6672 63.6635 208.8604 337.9137 44.0095 1.6842 2.4043 12.3411 30.3025 13.0696 21.3792 18.8928 125.3754 25.4765
temp: 298.150 k
press: 1.00000 atm
elementType: 8 8 7 7 6 6 6 6 6 6 6 6 1 1 1 1 1 1 1 1 1 1
symmnumber: 1
zpe: 451136.1 jmol-1
zpe.correction: 0.171829 hartree
zpe.thermalcorrener: 0.182304 hartree
zpe.thermalcorrenthalpy: 0.183248 hartree
zpe.thermalcorrgfe: 0.136488 hartree
zpe.sumelectzpe: -569.843614 hartree
zpe.sumelectthermal: -569.833139 hartree
zpe.sumelectthermalent: -569.832195 hartree
zpe.sumelectthermalfe: -569.878955 hartree
dipole: -8.0953 -0.0003 -0.0016
dipole: 8.0953
quadrupole: -66.9187 -63.7240 -72.8556
quadrupole: -0.0024 0.0002 0.0004
quadrupole: 0.9141 4.1087 -5.0228 -0.0024 0.0002 0.0004
hfenergy: -570.0154427 hartree
pointgroup: C01 [X(C8H10N2O2)]
dipole: -3.1849402 0.0022819 -0.0006197 debye
dipolederiv: -0.8230707 -0.2348031 -0.000012 -0.4326688 -0.7630596 0.0000976 -0.0001135 -0.0000061 -0.2356188 -0.8214663 0.2338458 -0.0001163 0.4325429 -0.7642339 0.0001173 -0.0002683 0.0002485 -0.2353931 2.1000662 0.0001757 0.0002428 -0.0004917 1.1929399 -0.000255 0.0004192 -0.0002525 0.1743185 -1.7832662 0.0004071 -0.0000272 -0.0000055 -0.1395173 -0.0000265 0.0001636 -0.0000268 -0.7136246 0.6450457 0.0845849 0.0000356 -0.232709 0.322658 -0.0000489 0.0001248 -0.0000019 0.0636613 0.6455324 -0.0852209 0.0000423 0.2328107 0.3220322 0.0000358 0.0000155 -0.0000154 0.0636045 -1.1661629 0.000222 -0.0001303 0.0004817 -0.2995971 0.0000342 -0.0001246 0.0000189 -0.0694838 -0.6705271 -0.1839256 -0.0000246 -0.525376 -0.1349529 -0.0000478 -0.0000012 -0.0000223 -0.269512 -0.6703883 0.1844642 -0.0000389 0.5253219 -0.1353227 0.0000348 -0.0000523 0.0000079 -0.2695155 1.8764275 -0.0003676 0.0000787 0.0001975 0.340434 -0.0000034 0.0000432 0.0000017 0.2215304 0.0340774 -0.2490114 0.0000103 -0.1226668 -0.093163 -0.0000016 0.0000032 -0.0000343 0.0152654 0.0342929 0.2501852 0.0000032 0.1231296 -0.0926586 0.0000311 -0.0000103 0.0000631 0.0151169 0.0004892 0.0778267 -0.0000178 0.0929949 -0.0683771 0.0000202 -0.0000248 0.0000145 0.1604702 0.0004672 -0.0777587 -0.0000105 -0.0930191 -0.0682648 -0.0000038 -0.0000095 -0.0000028 0.1604981 0.0475229 -0.0246044 -0.0876161 0.0056573 0.065584 0.0028418 -0.0690692 -0.025801 -0.011256 0.0475056 -0.0246081 0.0876272 0.005658 0.0655788 -0.002847 0.0690772 0.0258093 -0.0112403 -0.0437554 0.2126123 -0.000019 0.0644841 -0.0646768 0.0000119 -0.0000131 0.0000279 0.0989559 0.0474983 0.0245543 0.0874977 -0.005834 0.0657152 0.0029245 0.0689201 -0.0256117 -0.0111876 0.0475601 0.0245696 -0.0874687 -0.0058292 0.0657384 -0.0029215 -0.0688806 0.0256071 -0.0112051 -0.0438908 -0.2131251 -0.0000221 -0.0646921 -0.0653822 -0.0000164 -0.0000167 -0.0000469 0.0988581 0.2480189 -0.0121263 -0.0000163 -0.0776765 0.1242946 0.0000181 -0.00009 0.0000396 0.3828765 0.2480235 0.0121033 -0.0000182 0.0776902 0.1242307 0.0000047 -0.0000925 -0.0000168 0.3828808 unknown
polarizability: 177.312235|-0.0084479|131.1021679|0.0128452|-0.0057767|52.8131006 unknown
InChI: InChI=1S/C8H10N2O2/c1-5-3-7(9)4-6(2)8(5)10(11)12/h3-4H,9H2,1-2H3
charge 0 multiplicity 1
22 atoms
O  2.731321 1.129055 0.000185
O  2.728282 -1.133413 0.000683
N  2.090723 -0.001312 0.000158
N  -3.613172 0.000262 -0.000266
C  -0.091824 1.254683 -0.000127
C  -0.091994 -1.254346 -0.000017
C  0.620003 0.000037 -0.000008
C  -1.498259 1.220557 -0.000226
C  -1.498406 -1.220255 -0.000126
C  -2.226903 0.000192 -0.000216
C  0.545993 2.634252 -0.000147
C  0.546605 -2.633535 0.00006
H  -2.045917 2.170252 -0.000311
H  -2.046115 -2.169922 -0.00014
H  1.197276 2.785409 0.876741
H  1.197382 2.785334 -0.876965
H  -0.242547 3.406753 -0.000221
H  1.198234 -2.784114 -0.876689
H  1.19796 -2.78414 0.87701
H  -0.241326 -3.406626 -0.000073
H  -4.135761 0.872078 -0.000442
H  -4.135855 -0.871499 -0.000365
