program: Gaussian 09
title: 000036923
version: EM64L-G09RevD.01
frameworkgroup: C1[X(C17H22N2)]
method: RPBEPBE
basis: SDD
operation: Freq
keyword: #pfreq=noraman
keyword: PBEPBE/SDD
title: #p freq=noraman PBEPBE/SDD
converged: YES YES NO NO
title: Mulliken charges:
elementType: N N C C C C C C C C C C C C C C C C C H H H H H H H H H H H H H H H H H H H H H H
charge: -0.430394 -0.024023 0.139669 -0.478241 -0.434609 -0.410814 -0.466348 -0.097733 0.250006 0.256725 -0.315807 -0.108018 -0.104929 -0.359459 -0.326470 -0.690914 -0.696262 -0.291351 -0.235234 0.232496 0.200947 0.206588 0.203759 0.200218 0.211989 0.241140 0.229139 0.282459 0.205475 0.210212 0.191303 0.190988 0.236718 0.215640 0.208315 0.215213 0.220261 0.208255 0.261229 0.223828 0.228034
chargesum: 0.00000
title: Mulliken charges with hydrogens summed into heavy atoms:
elementType: N N C C C C C C C C C C C C C C C C C
charge: -0.147934 -0.024023 0.139669 -0.044797 -0.024262 0.001394 0.003931 -0.097733 0.250006 0.256725 0.099880 -0.108018 0.086374 -0.168471 -0.065241 -0.030240 -0.052533 -0.067523 -0.007200
polarizability: 2.31294323e+02 -8.39257822e+00 2.62767685e+02 -1.91905350e+01 -3.13865456e+00 1.20597540e+02
1716.lowfreq: -12.8122 -9.9942 -4.7504 -0.0007 0.0004 0.0005 18.2978 39.3654 53.0113
frequency: 17.0337 39.2445 52.9798 75.4669 90.9163 101.2219 150.1516 179.6921 191.2901 213.6180 229.6503 243.6864 279.2829 288.5516 300.8150 328.5767 368.5876 380.5775 394.9181 419.8172 430.7985 451.3396 496.3662 501.7144 510.7731 540.4191 589.2197 606.9197 617.0166 643.2867 671.8166 688.1835 761.2944 783.1881 810.6099 823.1475 831.5785 857.0687 868.2396 887.8828 905.5741 915.5600 920.0397 927.7524 943.7905 948.5431 962.4474 986.1708 988.1041 1025.9827 1030.9880 1078.9836 1093.5443 1113.0611 1125.2383 1131.4316 1140.4270 1153.4070 1164.0030 1165.4391 1179.6357 1199.9479 1233.1068 1239.4763 1250.4764 1259.9560 1279.6404 1292.6330 1307.4705 1327.1117 1334.3565 1338.3159 1339.5470 1348.5079 1352.3346 1379.8777 1389.4289 1395.3126 1401.4684 1415.7911 1441.4648 1450.9856 1458.7851 1466.2623 1467.8316 1469.3819 1472.1369 1477.0755 1481.4488 1481.9407 1488.2479 1507.9176 1550.2465 1572.8230 1617.2652 2940.3839 2947.8931 2956.1219 2971.6321 2975.4645 2975.8802 2978.2365 2980.9832 3014.8195 3036.8409 3040.4010 3049.7962 3056.4040 3063.3584 3071.6455 3076.2244 3079.9288 3108.0029 3131.2944 3150.1562 3166.8673 3537.2455
redmass: 2.9201 3.0451 3.5831 3.0602 3.0105 2.6792 2.9208 2.4452 1.3042 1.8865 2.3846 1.6015 2.7624 3.5054 3.9836 2.2103 2.6877 3.1847 2.3712 3.5697 2.6275 3.0703 2.6399 3.7032 1.4380 3.6962 3.8662 4.4426 4.3091 4.6641 3.6859 3.8049 1.4153 2.8383 3.1485 3.1709 1.7686 3.1070 1.8894 2.1018 1.7317 1.2819 1.8609 1.6923 1.6691 1.3820 1.6242 2.6674 1.3291 3.1791 2.3896 1.8815 1.5978 2.0159 2.5134 1.1921 2.0808 2.1134 1.5633 1.3268 1.8417 1.8618 2.1900 1.2790 1.3208 1.3684 1.5965 1.5935 1.8651 1.5705 1.6556 1.4726 1.4189 1.4718 1.6139 1.2132 3.8070 1.9535 1.8274 3.1057 2.7875 1.1363 1.2398 1.0849 1.0484 1.6419 1.1032 1.1145 1.1119 1.0592 1.0569 2.9176 5.6644 5.3217 6.2259 1.0829 1.0641 1.0671 1.0358 1.0630 1.0379 1.0616 1.0650 1.0941 1.0945 1.1005 1.1022 1.0959 1.0995 1.0984 1.0995 1.0989 1.0860 1.0880 1.0941 1.0994 1.0744
irintensity: 0.3338 0.3665 0.4431 0.2121 0.5293 0.5062 3.7010 0.4930 0.1735 0.6192 1.9957 0.3332 1.7768 0.9831 4.3894 0.4551 1.5955 0.9995 2.7913 1.2048 0.4802 2.2761 7.4987 4.2985 80.4080 3.8405 3.7450 28.5660 1.4169 4.1042 9.0367 2.1128 83.9120 2.0684 1.4087 4.7211 5.3194 6.1286 2.0246 5.1234 1.2401 7.2049 12.1501 1.8548 2.5176 2.4256 1.7161 14.1580 0.6864 0.2086 12.6121 0.1785 0.0236 6.3406 29.0272 2.1670 3.8399 30.0044 2.7459 0.8702 11.3312 0.7603 1.4444 5.7865 1.3898 3.2801 1.2550 1.2971 6.4513 8.1321 7.1565 5.2439 2.4160 11.6006 0.6511 10.5120 6.2752 99.7436 44.8095 23.0730 0.4741 30.6664 26.2322 2.1568 5.7756 31.0812 12.5079 1.6355 35.9300 12.8222 25.0078 249.9864 55.3165 55.5408 10.4525 29.3087 16.5379 92.5684 41.9556 37.8663 29.5863 32.2245 14.4125 27.8468 47.3940 57.9469 52.7262 10.6792 17.4279 74.1768 23.7337 59.2453 14.2721 13.8688 27.0490 28.1147 10.9065
temp: 298.150 k
press: 1.00000 atm
elementType: 7 7 6 6 6 6 6 6 6 6 6 6 6 6 6 6 6 6 6 1 1 1 1 1 1 1 1 1 1 1 1 1 1 1 1 1 1 1 1 1 1
symmnumber: 1
zpe: 923608.1 jmol-1
zpe.correction: 0.351784 hartree
zpe.thermalcorrener: 0.369605 hartree
zpe.thermalcorrenthalpy: 0.370549 hartree
zpe.thermalcorrgfe: 0.305249 hartree
zpe.sumelectzpe: -769.123941 hartree
zpe.sumelectthermal: -769.106119 hartree
zpe.sumelectthermalent: -769.105175 hartree
zpe.sumelectthermalfe: -769.170475 hartree
dipole: 4.2449 -0.6112 -0.6836
dipole: 4.3428
quadrupole: -112.2950 -103.8520 -117.6167
quadrupole: 2.0373 -0.8189 -1.8213
quadrupole: -1.0404 7.4026 -6.3621 2.0373 -0.8189 -1.8213
hfenergy: -769.4757243 hartree
pointgroup: C01 [X(C17H22N2)]
dipole: 1.5478608 -0.6681946 0.2773011 debye
polarizability: 246.9434075|17.7528376|247.0867768|16.4111895|-10.7579559|120.6293644 unknown
InChI: InChI=1S/C17H22N2/c1-12(2)11-18-17-13-7-3-5-9-15(13)19-16-10-6-4-8-14(16)17/h3,5,7,9,12,18H,4,6,8,10-11H2,1-2H3
charge 0 multiplicity 1
41 atoms
N  1.35847 -0.875193 0.866326
N  -2.066915 1.320135 -0.46231
C  0.316016 1.26452 0.184697
C  1.56392 2.073944 0.536153
C  1.270138 3.576585 0.733613
C  0.489838 4.113349 -0.483982
C  -0.891859 3.4331 -0.55379
C  -0.871788 1.93112 -0.282212
C  0.253726 -0.135751 0.418879
C  -1.016944 -0.821907 0.236535
C  2.746739 -0.773587 0.370987
C  -2.152419 -0.033493 -0.187137
C  3.314397 -2.159749 -0.041516
C  -1.201586 -2.228667 0.439087
C  -3.427376 -0.667612 -0.346556
C  2.582877 -2.732353 -1.277594
C  4.836115 -2.049486 -0.292747
C  -2.45627 -2.825001 0.274437
C  -3.582732 -2.035785 -0.113982
H  2.018559 1.643663 1.449791
H  2.330951 1.986536 -0.260998
H  0.669745 3.730959 1.652499
H  2.222323 4.124298 0.868432
H  1.069412 3.904428 -1.406035
H  0.364542 5.21087 -0.425142
H  -1.375556 3.593367 -1.535149
H  -1.572387 3.891527 0.191581
H  1.142929 -1.76586 1.316814
H  3.415084 -0.326694 1.136577
H  2.76171 -0.110126 -0.511568
H  3.160936 -2.854492 0.814681
H  -0.354835 -2.87139 0.710895
H  1.487939 -2.760973 -1.131141
H  2.925891 -3.759318 -1.500577
H  2.784938 -2.107801 -2.168901
H  5.372059 -1.692215 0.606402
H  5.260535 -3.029806 -0.575312
H  5.046458 -1.342938 -1.118659
H  -4.26284 -0.033226 -0.658958
H  -2.574356 -3.90286 0.431743
H  -4.562688 -2.509815 -0.238562
