program: Gaussian 09
title: 000036918
version: EM64L-G09RevD.01
frameworkgroup: C1[X(C16H11N)]
method: RPBEPBE
basis: SDD
operation: Freq
keyword: #pfreq=noraman
keyword: PBEPBE/SDD
title: #p freq=noraman PBEPBE/SDD
converged: NO YES NO YES
title: Mulliken charges:
elementType: N C C C C C C C C C C C C C C C C H H H H H H H H H H H
charge: -0.048167 0.095249 0.234510 0.191896 -0.072247 0.397120 -0.588636 -0.049562 -0.324354 -0.453123 -0.434983 -0.203780 -0.345049 -0.227014 -0.333605 -0.275300 -0.224435 0.258324 0.258323 0.259283 0.241213 0.248695 0.229551 0.225509 0.236128 0.255664 0.222724 0.226065
chargesum: 0.00000
title: Mulliken charges with hydrogens summed into heavy atoms:
elementType: N C C C C C C C C C C C C C C C C
charge: -0.048167 0.095249 0.234510 0.191896 -0.072247 0.397120 -0.071990 -0.049562 -0.065071 -0.211910 -0.186288 0.025771 -0.119539 0.009114 -0.077941 -0.052576 0.001630
polarizability: 3.73044056e+02 1.31121480e+01 2.05842139e+02 2.17404146e-02 1.30769484e-03 7.07777871e+01
1716.lowfreq: -9.7276 -0.0003 0.0004 0.0007 7.3128 12.8412 71.6832 94.4559 147.7826
frequency: 71.6769 94.4494 147.7823 149.1554 189.9962 256.2818 304.3005 321.8572 353.4164 372.3668 430.6463 465.7066 485.7028 509.4284 520.6821 545.7711 578.1038 581.9576 627.1806 630.6691 663.2436 710.9667 740.2869 747.7168 770.4925 776.8120 797.5737 817.6122 843.4495 872.3744 913.4827 925.8885 931.0506 932.2679 940.7248 977.2536 979.4247 987.2902 996.6102 1021.7888 1059.6033 1091.3454 1107.6936 1154.9912 1170.4823 1170.6113 1180.8844 1188.8807 1206.7740 1251.3538 1281.3577 1325.5476 1334.4732 1352.5147 1379.2690 1398.1123 1408.0243 1420.7908 1425.4601 1456.1760 1487.5228 1543.5754 1559.4980 1578.9770 1604.6628 1617.0383 1642.0171 2928.1063 2954.2205 3121.7376 3125.0542 3128.3752 3131.4521 3137.6063 3153.2214 3158.6688 3163.4059 3166.0144
redmass: 3.9046 4.4939 4.8926 3.2241 3.4073 3.0695 4.3429 4.9379 4.0868 6.3416 2.9792 6.1697 2.6514 7.0811 3.0492 5.3466 3.7726 6.5667 3.1633 6.5528 5.9481 1.2629 6.6763 1.7584 2.2004 2.7947 5.6563 1.7433 6.1091 1.4569 1.9381 4.1883 1.6879 6.2010 1.4149 1.3300 1.3248 1.3583 2.7486 2.1949 2.3481 2.0281 1.6665 1.3772 1.1029 1.2700 1.8826 1.7408 2.2748 1.6414 1.7401 2.0992 2.2647 3.2375 2.1319 2.3017 1.2797 2.8821 2.7481 2.8382 5.5211 6.5708 6.7267 6.1914 6.7115 6.9757 8.1510 1.0614 1.0942 1.0868 1.0848 1.0882 1.0897 1.0899 1.0948 1.1000 1.0970 1.0991
irintensity: 0.0014 1.3049 0.1716 4.9799 0.5271 2.1188 1.0139 4.4890 8.8127 4.3320 1.5400 0.1609 0.3350 1.6454 5.9012 2.0888 0.1936 9.5730 6.9514 0.1262 5.9351 70.8116 2.2912 29.7391 36.8847 0.5662 0.2715 50.8053 2.1204 1.2481 20.2913 24.8925 4.6292 3.7058 2.9976 0.1911 0.3024 0.0658 1.2742 8.7543 4.3212 0.2833 4.6233 13.0467 0.7323 2.7174 22.5582 6.0838 6.9623 5.0167 0.2267 17.1489 4.6083 37.8096 19.5981 7.5694 34.9760 21.2659 52.3279 5.3452 8.9669 3.9822 11.8891 14.4644 59.7359 7.0282 6.4172 1.8330 4.2795 4.5341 0.5114 1.3735 15.8142 13.2833 26.2722 42.7898 21.2491 34.5745
temp: 298.150 k
press: 1.00000 atm
elementType: 7 6 6 6 6 6 6 6 6 6 6 6 6 6 6 6 6 1 1 1 1 1 1 1 1 1 1 1
symmnumber: 1
zpe: 571509.6 jmol-1
zpe.correction: 0.217677 hartree
zpe.thermalcorrener: 0.229536 hartree
zpe.thermalcorrenthalpy: 0.230480 hartree
zpe.thermalcorrgfe: 0.179858 hartree
zpe.sumelectzpe: -669.901636 hartree
zpe.sumelectthermal: -669.889776 hartree
zpe.sumelectthermalent: -669.888832 hartree
zpe.sumelectthermalfe: -669.939454 hartree
dipole: -3.9829 -3.6570 0.0002
dipole: 5.4071
quadrupole: -81.3826 -90.2637 -104.3257
quadrupole: -4.4280 0.0019 -0.0008
quadrupole: 10.6081 1.7270 -12.3351 -4.4280 0.0019 -0.0008
hfenergy: -670.1193122 hartree
pointgroup: C01 [X(C16H11N1)]
dipole: -1.5638347 -1.4421895 0.0000763 debye
polarizability: 372.9859792|13.477223|205.9002154|0.0217375|0.0013552|70.7777871 unknown
InChI: InChI=1S/C16H11N/c1-2-6-12-11(5-1)9-10-15-16(12)13-7-3-4-8-14(13)17-15/h1-5,7-10H,6H2
charge 0 multiplicity 1
28 atoms
N  1.600752 1.983202 0.000036
C  0.041443 0.196663 0.000062
C  -1.24682 -0.318568 -0.000009
C  1.382747 -0.395671 0.000103
C  0.284259 1.657094 0.00002
C  -2.368885 0.629122 -0.000133
C  -1.527414 -1.81234 0.000063
C  2.289103 0.731919 0.000076
C  -0.825941 2.5726 0.000007
C  -2.112255 2.064294 -0.000082
C  -3.681562 0.141149 -0.000298
C  -2.979731 -2.209631 -0.000475
C  1.894625 -1.71062 0.000252
C  -3.986366 -1.273754 -0.000527
C  3.684306 0.542992 0.000113
C  3.302004 -1.895424 0.000299
C  4.182988 -0.78383 0.000208
H  -1.024266 -2.283188 -0.874415
H  -1.025255 -2.282733 0.875402
H  -0.62684 3.648775 -0.000003
H  -2.978182 2.736905 -0.000162
H  -4.512066 0.858207 -0.000299
H  -3.210309 -3.282028 -0.000744
H  1.237198 -2.58684 0.000383
H  -5.035309 -1.589393 -0.000809
H  4.354807 1.408186 0.00009
H  3.714201 -2.910712 0.0004
H  5.265667 -0.954676 0.000242
