program: Gaussian 09
title: 000036924
version: EM64L-G09RevD.01
frameworkgroup: C1[X(C15H18N2)]
method: RPBEPBE
basis: SDD
operation: Freq
keyword: #pfreq=noraman
keyword: PBEPBE/SDD
title: #p freq=noraman PBEPBE/SDD
converged: YES YES NO NO
title: Mulliken charges:
elementType: N N C C C C C C C C C C C C C C C H H H H H H H H H H H H H H H H H H
charge: -0.014794 -0.421618 -0.508562 0.161431 -0.430436 -0.408353 -0.465991 -0.099065 0.220750 0.299788 -0.127800 -0.571801 -0.331135 0.427560 -0.358059 -0.631122 -0.819694 0.211015 0.233668 0.203762 0.206484 0.209792 0.200581 0.226773 0.240915 0.192828 0.292839 0.259669 0.231663 0.233199 0.240819 0.215407 0.219458 0.229933 0.230099
chargesum: 0.00000
title: Mulliken charges with hydrogens summed into heavy atoms:
elementType: N N C C C C C C C C C C C C C C C
charge: -0.014794 -0.128779 -0.063880 0.161431 -0.020189 0.002019 0.001697 -0.099065 0.220750 0.299788 -0.127800 -0.378974 -0.071467 0.427560 -0.126396 0.058303 -0.140204
polarizability: 2.66086202e+02 -3.82252649e+00 1.91893207e+02 -1.56817292e+00 -2.46436263e+00 9.65601362e+01
1716.lowfreq: -4.6809 -0.0006 -0.0005 -0.0004 4.0509 10.3654 50.4209 76.9974 88.5214
frequency: 50.3993 76.9692 88.5192 93.6609 108.8570 125.8134 160.8354 193.7935 207.9622 229.9519 274.0111 307.8811 331.4136 341.5681 366.2566 375.3600 429.6471 443.9652 475.1769 494.4059 505.6120 539.7248 553.9571 587.3007 616.4328 648.1829 683.5133 696.7757 762.1089 785.2310 822.8878 832.6951 834.1936 869.4901 878.6770 896.8775 912.0870 947.5494 979.8994 982.0048 998.8555 1019.2398 1045.8638 1079.8163 1095.3168 1113.7367 1124.2750 1130.4691 1138.7787 1155.9530 1161.2651 1166.4870 1227.7433 1237.7909 1247.9405 1258.0061 1281.3336 1297.7381 1327.9988 1332.7529 1339.3931 1349.4503 1389.6234 1393.0770 1398.4031 1410.5734 1421.2231 1447.7572 1451.2603 1457.4629 1466.8727 1472.1285 1472.3500 1474.7626 1478.8986 1480.7754 1502.7038 1514.9166 1552.4852 1576.9997 1630.4860 2954.6783 2966.5226 2972.0657 2976.7379 2978.2579 2978.6557 3010.2529 3038.0899 3040.3429 3046.2751 3049.1115 3050.4151 3078.8626 3079.3555 3096.0649 3121.9385 3160.8852 3568.0084
redmass: 3.5344 2.2166 1.1050 1.5413 2.3514 2.0210 2.8263 3.4873 3.2141 3.3377 2.6283 2.8421 2.6216 2.8801 4.3440 3.6217 3.8266 2.5410 4.1544 2.6465 1.8605 3.0839 3.0401 3.3383 4.5374 4.4903 3.9058 4.0322 5.2103 2.5585 3.5067 1.4552 1.8115 1.8704 3.2288 2.0926 1.5746 2.2423 1.3382 2.6344 2.1974 2.1431 1.5480 1.8633 1.4851 1.3318 1.7430 1.2856 1.9536 1.9346 1.6356 1.9136 2.2342 2.3791 1.5046 1.3605 1.5620 2.7821 1.8127 1.4789 1.4766 1.6639 3.9484 2.0983 1.6304 4.1574 2.4318 1.2634 1.1174 1.1221 1.0466 1.4905 1.0980 1.1460 1.2680 1.3164 1.3137 1.9040 5.8938 4.5902 6.2064 1.0578 1.0396 1.0370 1.0650 1.0622 1.0649 1.0960 1.0946 1.1004 1.0993 1.0975 1.1022 1.0988 1.0994 1.0893 1.0888 1.0958 1.0752
irintensity: 0.4456 1.4478 0.7932 2.2442 1.8769 0.2504 1.7725 1.8139 3.6999 0.1186 1.2696 0.5299 2.8277 0.9934 5.8402 1.9474 0.2063 10.6076 0.2048 23.1515 46.0250 3.2062 19.7669 1.5872 9.1026 9.9105 1.0068 1.5920 3.9954 1.9857 3.6621 55.2771 2.9446 0.5382 3.3238 4.0357 4.8194 4.6030 1.5536 10.5467 1.0699 10.5633 11.2379 0.1494 0.0188 0.7193 4.3097 4.1095 15.2698 16.6455 3.2801 0.4804 2.7677 1.2646 5.3021 1.6936 1.6672 5.4430 3.2396 2.9257 1.2030 3.5535 35.6808 57.5162 43.6798 5.0373 28.4091 5.8421 21.5556 6.6406 11.8020 44.2391 11.0356 26.4144 1.8069 2.4689 6.2597 193.8126 56.7789 58.1352 4.0270 3.4692 123.8661 51.8920 43.9564 33.0752 16.4284 21.3202 57.0821 60.8534 37.5018 20.4307 67.7176 12.4432 27.8979 32.3132 17.3199 14.8661 12.5929
temp: 298.150 k
press: 1.00000 atm
elementType: 7 7 6 6 6 6 6 6 6 6 6 6 6 6 6 6 6 1 1 1 1 1 1 1 1 1 1 1 1 1 1 1 1 1 1
symmnumber: 1
zpe: 776383.2 jmol-1
zpe.correction: 0.295709 hartree
zpe.thermalcorrener: 0.311191 hartree
zpe.thermalcorrenthalpy: 0.312135 hartree
zpe.thermalcorrgfe: 0.253446 hartree
zpe.sumelectzpe: -690.679024 hartree
zpe.sumelectthermal: -690.663542 hartree
zpe.sumelectthermalent: -690.662598 hartree
zpe.sumelectthermalfe: -690.721287 hartree
dipole: 0.1411 4.0272 0.2420
dipole: 4.0369
quadrupole: -87.1041 -94.5343 -104.8881
quadrupole: 0.3883 -0.8460 1.7659
quadrupole: 8.4047 0.9746 -9.3793 0.3883 -0.8460 1.7659
hfenergy: -690.974733 hartree
pointgroup: C01 [X(C15H18N2)]
dipole: 0.0564251 1.5786247 0.1650987 debye
polarizability: 265.993933|-3.635|191.9142955|-4.4814331|1.8633454|96.6313167 unknown
InChI: InChI=1S/C15H18N2/c1-10-7-8-14-12(9-10)15(16-2)11-5-3-4-6-13(11)17-14/h7-9,16H,3-6H2,1-2H3
charge 0 multiplicity 1
35 atoms
N  -0.324442 -1.823804 0.071503
N  -0.119832 2.449495 -0.082077
C  -2.774987 1.122739 -0.172984
C  -1.458794 0.366846 -0.000089
C  -3.959907 0.209305 -0.557228
C  -4.004685 -1.014912 0.378679
C  -2.744634 -1.874018 0.155351
C  -1.449273 -1.070535 0.087606
C  -0.213124 1.047464 -0.027482
C  1.015116 0.267875 -0.038153
C  0.892123 -1.170785 -0.016869
C  2.32968 0.841143 -0.056087
C  2.080571 -1.969138 -0.067125
C  3.486287 0.050749 -0.101083
C  3.341339 -1.377377 -0.117178
C  -0.905577 3.382566 0.745865
C  4.872545 0.670114 -0.11815
H  -3.042753 1.656592 0.762165
H  -2.63218 1.904466 -0.945128
H  -4.901922 0.787635 -0.503833
H  -3.848715 -0.137018 -1.604361
H  -4.911159 -1.622007 0.195929
H  -4.0531 -0.66912 1.4311
H  -2.840849 -2.435128 -0.796177
H  -2.626136 -2.640102 0.943531
H  2.463341 1.930348 -0.011159
H  0.792303 2.805164 -0.365445
H  1.950646 -3.055966 -0.060102
H  4.24121 -2.00382 -0.15549
H  -1.063435 2.98496 1.767604
H  -1.893425 3.620626 0.313474
H  -0.344354 4.32922 0.834903
H  4.828179 1.772284 -0.075903
H  5.478386 0.32341 0.74057
H  5.425058 0.390528 -1.035579
