program: Gaussian 09
title: 000036941
version: EM64L-G09RevD.01
frameworkgroup: C1[X(C13H11NO4S)]
method: RPBEPBE
basis: SDD
operation: Freq
keyword: #p
keyword: freq=noraman
keyword: PBEPBE/SDD
title: #p freq=noraman PBEPBE/SDD
converged: YES YES NO NO
title: Mulliken charges:
elementType: S O O O O N C C C C C C C C C C C C C H H H H H H H H H H H
charge: 0.997410 -0.518307 -0.511908 -0.432449 -0.311888 -0.767804 -0.003861 0.417594 0.085400 -0.333617 -0.247442 -0.253312 -0.299753 -0.215937 -0.202656 -0.208530 -0.251516 -0.215331 0.161855 0.418273 0.260944 0.286427 0.283291 0.275784 0.232590 0.244619 0.243762 0.236337 0.240331 0.389694
chargesum: 0.00000
title: Mulliken charges with hydrogens summed into heavy atoms:
elementType: S O O O O N C C C C C C C C C C C C C
charge: 0.997410 -0.518307 -0.511908 -0.042755 -0.311888 -0.349532 -0.003861 0.417594 0.085400 -0.072673 0.038985 0.029979 -0.023969 0.016653 0.041964 0.035232 -0.015179 0.025000 0.161855
polarizability: 2.20334072e+02 -8.55572523e-01 2.05072665e+02 -3.30672195e+00 1.22385625e+01 1.41807962e+02
1716.lowfreq: -6.7103 -4.8830 -0.0018 -0.0017 0.0007 4.9057 15.2901 19.8502 41.0027
frequency: 15.2350 19.7879 40.9827 80.2136 106.3015 114.0569 141.9548 147.3298 170.7708 203.1376 219.5864 247.4706 258.9458 266.9945 343.3847 373.7665 392.5286 403.6096 415.2480 439.1136 485.4943 513.4764 520.5566 576.5848 577.7152 601.6505 602.5539 651.2987 682.1968 684.3822 691.8577 731.0710 739.1373 759.0028 764.0347 784.1643 810.4792 847.0166 854.7181 872.7467 932.7675 951.3847 969.3987 977.3884 982.5222 992.2891 1005.5076 1007.6573 1015.5385 1043.0675 1046.9846 1078.7040 1108.8972 1165.8282 1174.3388 1176.1740 1179.0728 1222.1262 1304.2812 1309.2213 1317.5257 1372.1860 1383.6589 1390.3809 1437.0800 1438.3825 1452.2310 1478.0477 1568.0105 1575.7840 1584.0578 1604.5163 1627.5296 3136.8499 3139.8079 3149.9613 3158.4249 3158.9972 3167.4803 3172.9059 3176.9786 3181.9087 3212.9233 3534.0810
redmass: 5.6536 5.9307 4.4320 8.1970 5.9731 8.5683 5.7313 6.3680 8.2005 6.5699 9.1925 8.9746 6.2207 6.3895 7.8300 9.1079 9.6163 2.8293 3.1125 13.1430 4.2503 6.6045 3.2645 5.4865 1.2031 6.4181 6.2077 6.8024 4.3434 3.5429 3.0322 1.5374 3.2380 1.8045 1.3925 1.9860 9.8019 1.2627 5.2575 1.4735 1.3550 12.6241 1.3802 5.5630 1.4294 1.3486 1.3719 3.9658 5.2943 2.2005 2.1139 1.5531 1.8264 1.6282 1.0618 1.1642 1.1209 1.3579 1.3022 1.5531 2.6782 2.6630 8.1730 6.2868 2.3985 2.5223 2.0267 2.4974 5.3143 5.8101 5.7691 6.9518 6.2197 1.0873 1.0859 1.0885 1.0917 1.0912 1.0969 1.0944 1.1014 1.0992 1.0817 1.0642
irintensity: 0.4584 1.0961 0.2194 0.1712 0.3242 2.0582 0.3396 1.7347 4.1139 5.3281 4.8536 5.2557 0.2450 0.7625 4.3599 66.6807 5.8892 0.0360 4.8779 140.7761 42.9117 50.3072 5.1903 13.1718 117.9647 28.9014 69.2705 4.3455 40.8633 2.8257 64.0303 95.8335 6.7278 62.5672 110.5914 1.5191 144.2410 1.2157 62.7498 1.9649 2.0514 70.4641 2.6195 3.0860 0.5877 1.1366 0.9736 0.7337 276.7830 46.7812 16.9957 4.4989 107.4257 113.9329 1.2319 15.2323 4.3421 15.1684 4.3554 22.6575 265.5506 78.2233 4.0730 3.5542 30.0950 31.3888 16.4442 213.9893 61.4161 3.1751 76.2439 0.9687 262.3555 6.8316 0.8929 8.9718 5.2256 6.4819 2.1287 1.5529 24.6335 11.9223 317.5144 72.3431
temp: 298.150 k
press: 1.00000 atm
elementType: 16 8 8 8 8 7 6 6 6 6 6 6 6 6 6 6 6 6 6 1 1 1 1 1 1 1 1 1 1 1
symmnumber: 1
zpe: 563521.4 jmol-1
zpe.correction: 0.214634 hartree
zpe.thermalcorrener: 0.231852 hartree
zpe.thermalcorrenthalpy: 0.232797 hartree
zpe.thermalcorrgfe: 0.167330 hartree
zpe.sumelectzpe: -1254.180708 hartree
zpe.sumelectthermal: -1254.163489 hartree
zpe.sumelectthermalent: -1254.162545 hartree
zpe.sumelectthermalfe: -1254.228011 hartree
dipole: -0.2570 3.3937 -5.4373
dipole: 6.4146
quadrupole: -98.9481 -111.9831 -124.2677
quadrupole: -7.9158 8.9079 8.6684
quadrupole: 12.7849 -0.2501 -12.5347 -7.9158 8.9079 8.6684
hfenergy: -1254.3953415 hartree
pointgroup: C01 [X(C13H11N1O4S1)]
dipole: 0.1144744 -1.9841005 -1.555396 debye
polarizability: 217.4454002|-7.6992404|146.8001834|3.099351|-20.8239132|202.9691153 unknown
InChI: InChI=1S/C13H11NO4S/c15-13(16)11-8-4-5-9-12(11)14-19(17,18)10-6-2-1-3-7-10/h1-9,14-15H
charge 0 multiplicity 1
30 atoms
S  -1.1802 1.473691 0.683386
O  -1.928952 1.575816 2.11745
O  -0.766803 2.787694 -0.180337
O  3.365677 -2.053983 2.530469
O  1.348551 -1.017588 2.970934
N  0.285028 0.47408 1.098037
C  -2.187817 0.339067 -0.454496
C  1.407632 0.237254 0.30876
C  2.441005 -0.636986 0.819761
C  1.581746 0.809065 -0.986767
C  -2.91744 -0.698491 0.148231
C  -2.190977 0.612743 -1.830466
C  3.583384 -0.920742 0.019751
C  2.720502 0.50537 -1.749881
C  -3.682133 -1.532106 -0.699589
C  -2.963979 -0.233556 -2.660027
C  3.728508 -0.36586 -1.25951
C  -3.699607 -1.302131 -2.096556
C  2.310207 -1.217623 2.160904
H  0.283406 0.098481 2.071585
H  0.846796 1.526501 -1.360533
H  -2.904472 -0.838121 1.233902
H  -1.635252 1.466534 -2.230811
H  4.346592 -1.584843 0.434932
H  2.831836 0.96436 -2.738766
H  -4.26539 -2.352225 -0.268701
H  -2.993542 -0.052266 -3.739269
H  4.610991 -0.590665 -1.865641
H  -4.29649 -1.951856 -2.74553
H  3.196294 -2.388012 3.451781
