program: Gaussian 09
title: 000036948
version: EM64L-G09RevD.01
frameworkgroup: C1[X(C13H12F6O2)]
method: RPBEPBE
basis: SDD
operation: Freq
keyword: #p
keyword: freq=noraman
keyword: PBEPBE/SDD
title: #p freq=noraman PBEPBE/SDD
converged: YES YES NO NO
title: Mulliken charges:
elementType: F F F F F F O O C C C C C C C C C C C C C H H H H H H H H H H H H
charge: -0.162976 -0.156089 -0.116019 -0.159759 -0.124287 -0.144386 -0.408750 -0.496744 -0.181159 0.015707 -0.499034 -0.319167 -0.581960 0.260628 0.311093 0.366913 0.353490 -0.379110 -0.387816 -0.248359 -0.234506 0.276178 0.230988 0.266058 0.309627 0.239831 0.238841 0.253624 0.389803 0.240913 0.373188 0.237681 0.235559
chargesum: 0.00000
title: Mulliken charges with hydrogens summed into heavy atoms:
elementType: F F F F F F O O C C C C C C C C C C C C C
charge: -0.162976 -0.156089 -0.116019 -0.159759 -0.124287 -0.144386 -0.018947 -0.123557 0.095019 0.015707 -0.001987 -0.009541 -0.103287 0.260628 0.311093 0.366913 0.353490 -0.125486 -0.146903 -0.010678 0.001052
polarizability: 1.87175570e+02 -3.09896424e+00 1.37293776e+02 -9.24297030e+00 -1.39504243e+01 1.05476997e+02
1716.lowfreq: -6.0586 -0.0007 -0.0004 0.0007 2.0183 9.5178 26.3453 50.6148 54.4166
frequency: 26.1383 50.6047 54.3286 79.9635 106.8330 124.1059 160.0638 161.7559 192.9136 218.3525 233.7218 237.4391 261.7224 272.7283 283.9082 300.3696 304.4562 313.2851 344.1366 368.8731 388.6415 416.7721 438.5901 460.8340 466.4955 479.1889 489.0878 529.0896 552.5907 556.8807 598.3717 624.7768 644.9008 653.1731 715.5213 729.0679 764.2258 773.6178 788.6202 837.4680 851.9840 865.3378 884.8142 893.4830 915.2754 959.1734 966.4206 981.9494 997.4955 1004.4679 1029.2277 1036.0524 1041.9211 1058.1196 1076.0118 1096.2581 1098.3894 1126.6414 1151.0884 1156.8041 1164.1696 1178.2814 1186.9670 1211.6892 1219.2067 1237.7115 1271.0776 1299.9693 1323.3078 1337.8673 1350.0972 1363.7318 1383.1468 1395.5979 1445.4673 1454.6046 1478.0974 1489.3758 1498.2913 1592.4151 1615.1105 2964.1403 3002.6320 3012.6898 3013.2108 3034.3325 3106.7511 3110.1912 3121.1495 3129.8627 3145.5796 3166.8152 3588.3536
redmass: 6.1806 16.4093 6.1590 6.0667 7.4221 8.4516 12.4326 5.1356 4.9740 4.4468 4.8080 7.8653 6.7090 7.6701 9.1196 11.1471 9.5322 2.9580 1.3881 4.6628 3.3401 8.8971 2.9836 16.7890 13.9490 4.1948 14.1868 4.5405 9.5778 5.3976 4.3504 12.7127 5.3114 4.2818 3.8606 2.4503 4.8245 1.4782 2.1530 1.5778 5.7869 2.6411 1.5073 4.0440 2.8481 1.9674 2.1692 5.7095 1.3357 7.1020 3.0483 2.5463 3.0175 5.2374 6.1818 2.4168 4.6046 2.9629 1.9343 6.4471 2.1134 1.0635 1.5041 1.9942 1.8748 1.5088 1.3983 1.5224 1.4020 1.2570 1.2197 1.3382 2.7748 1.9920 2.3380 1.1295 1.1014 2.0515 1.3030 6.6846 6.3558 1.0658 1.0751 1.0750 1.0741 1.0921 1.0866 1.0946 1.0876 1.0890 1.0936 1.1004 1.0667
irintensity: 0.2985 0.1215 0.6686 0.2488 0.7588 0.4803 1.2003 3.0217 2.3254 0.5121 1.2319 0.4483 2.1431 2.6521 11.0067 12.0161 1.4058 21.5150 65.6671 9.1064 5.6095 3.2752 8.8089 2.4948 7.0175 6.0358 0.7689 2.9549 5.6716 15.8275 27.4699 28.7944 2.7583 3.3658 13.8452 26.5071 4.0203 57.4185 57.5328 33.6352 47.4175 39.3549 4.1373 66.9811 19.0889 30.6338 21.1378 41.2719 0.0158 73.1492 2.4245 49.7469 157.0179 187.5715 118.2115 18.7323 51.1818 5.5338 121.1607 327.0838 29.4045 0.6966 50.0767 1.5532 26.7708 4.9002 2.7076 15.8936 4.2807 9.1498 41.0894 2.9361 2.0576 1.3639 4.9533 20.1261 9.4793 10.8551 140.5328 0.8547 5.4969 16.2684 32.6365 406.1650 321.1416 35.7365 2.7624 9.9322 7.7216 1.0139 19.7556 23.8754 16.4309
temp: 298.150 k
press: 1.00000 atm
elementType: 9 9 9 9 9 9 8 8 6 6 6 6 6 6 6 6 6 6 6 6 6 1 1 1 1 1 1 1 1 1 1 1 1
symmnumber: 1
zpe: 610612.4 jmol-1
zpe.correction: 0.232570 hartree
zpe.thermalcorrener: 0.251332 hartree
zpe.thermalcorrenthalpy: 0.252276 hartree
zpe.thermalcorrgfe: 0.185846 hartree
zpe.sumelectzpe: -1250.509987 hartree
zpe.sumelectthermal: -1250.491225 hartree
zpe.sumelectthermalent: -1250.490280 hartree
zpe.sumelectthermalfe: -1250.556711 hartree
dipole: 7.4978 2.0175 -0.1513
dipole: 7.7660
quadrupole: -120.3016 -118.3453 -123.1657
quadrupole: 0.1391 2.0082 -0.6954
quadrupole: 0.3026 2.2589 -2.5615 0.1391 2.0082 -0.6954
hfenergy: -1250.7425567 hartree
pointgroup: C01 [X(C13H12F6O2)]
dipole: 2.9516361 -0.7841422 -0.0906359 debye
polarizability: 187.4426299|1.8916326|140.3665852|8.2631752|-9.3740434|102.1371283 unknown
InChI: InChI=1S/C13H12F6O2/c14-12(15,16)11(21,13(17,18)19)9-6-5-7-3-1-2-4-8(7)10(9)20/h1-4,9-10,20-21H,5-6H2
charge 0 multiplicity 1
33 atoms
F  -1.307406 2.274103 0.989364
F  -2.382655 0.628756 2.112632
F  -3.457674 1.819087 0.510122
F  -2.600521 -1.866221 0.9055
F  -4.072962 -0.657427 -0.31048
F  -2.494584 -1.870883 -1.362976
O  -1.899923 0.813889 -1.524697
O  0.610477 0.843218 -1.96958
C  -0.256177 -0.247877 0.111957
C  -1.739645 0.181526 -0.245723
C  0.186094 -1.67224 -0.321168
C  0.772297 0.773199 -0.46436
C  1.547393 -2.006641 0.329526
C  2.209481 0.426378 -0.130284
C  2.588866 -0.903618 0.20024
C  -2.242669 1.2188 0.829786
C  -2.728355 -1.042947 -0.246094
C  3.190801 1.449162 -0.194545
C  3.956662 -1.178649 0.451741
C  4.546715 1.163596 0.059153
C  4.930213 -0.160724 0.382403
H  -0.173731 -0.207883 1.216658
H  0.249299 -1.735942 -1.424149
H  -0.538883 -2.434045 0.000004
H  0.5323 1.79739 -0.147061
H  1.942197 -2.947867 -0.09734
H  1.380628 -2.208435 1.408499
H  2.881675 2.470066 -0.44845
H  -0.990975 0.849804 -1.987976
H  4.257432 -2.202012 0.707685
H  1.237375 0.213499 -2.403488
H  5.296495 1.959958 0.009206
H  5.98186 -0.394922 0.580796
