program: Gaussian 09
title: 000036904
version: EM64L-G09RevD.01
frameworkgroup: C1[X(C6H2Cl4O2S)]
method: RPBEPBE
basis: SDD
operation: Freq
keyword: #p
keyword: freq=noraman
keyword: PBEPBE/SDD
title: #p freq=noraman PBEPBE/SDD
converged: NO NO NO NO
title: Mulliken charges:
elementType: Cl Cl Cl Cl S O O C C C C C C H H
charge: 0.096176 -0.166949 0.073615 0.044970 0.896332 -0.425935 -0.457226 -0.035545 -0.092795 -0.214925 -0.030617 -0.194932 -0.087230 0.312156 0.282905
chargesum: 0.00000
title: Mulliken charges with hydrogens summed into heavy atoms:
elementType: Cl Cl Cl Cl S O O C C C C C C
charge: 0.096176 -0.166949 0.073615 0.044970 0.896332 -0.425935 -0.457226 -0.035545 -0.092795 0.097231 -0.030617 0.087973 -0.087230
polarizability: 1.96351735e+02 5.61355972e+00 1.46348913e+02 3.94213610e-01 3.55676933e+00 8.81287425e+01
1716.lowfreq: -7.8285 -3.3407 0.0030 0.0036 0.0037 5.1932 36.0058 48.6983 79.8956
frequency: 36.0053 48.6924 79.8943 105.2123 139.6236 170.1919 188.9933 204.8352 211.2072 234.1359 244.1593 251.7030 301.1223 330.7135 386.6048 414.0958 464.3217 479.6583 513.1981 537.3760 553.4281 717.2088 720.7794 763.3273 820.7048 828.6068 961.5952 963.1370 997.2609 1108.3319 1151.0614 1162.4516 1333.6639 1367.3279 1399.2429 1543.7044 1560.2129 3165.8180 3186.9377
redmass: 23.5810 18.0465 25.8484 11.9568 15.6040 16.9204 26.0599 24.2584 17.7323 8.4003 21.1593 16.5913 8.5501 27.4487 18.8915 12.9504 6.8217 12.0339 4.7726 12.0224 6.0643 8.6555 8.1321 9.4723 1.3247 18.2593 2.1339 2.9869 10.2195 5.4821 1.5130 1.8067 5.3641 8.3637 2.3118 7.2805 8.8050 1.0899 1.0968
irintensity: 0.0689 1.3624 0.1245 1.6458 2.4510 0.8334 0.3898 0.8214 1.1283 2.0723 0.0238 2.9727 7.5928 1.6590 76.0517 84.2695 13.9923 23.0927 2.5839 4.9971 21.7533 7.2051 4.8302 68.8316 41.8514 73.0523 20.0536 24.6698 3.2658 58.7158 2.8213 45.4832 90.8120 11.0906 46.6865 45.0036 1.1550 12.6603 3.0625
temp: 298.150 k
press: 1.00000 atm
elementType: 17 17 17 17 16 8 8 6 6 6 6 6 6 1 1
symmnumber: 1
zpe: 177325.7 jmol-1
zpe.correction: 0.067540 hartree
zpe.thermalcorrener: 0.081181 hartree
zpe.thermalcorrenthalpy: 0.082126 hartree
zpe.thermalcorrgfe: 0.025056 hartree
zpe.sumelectzpe: -2617.458101 hartree
zpe.sumelectthermal: -2617.444459 hartree
zpe.sumelectthermalent: -2617.443515 hartree
zpe.sumelectthermalfe: -2617.500584 hartree
dipole: -4.4387 -1.9390 0.1640
dipole: 4.8465
quadrupole: -124.2015 -103.9869 -113.9199
quadrupole: 4.0011 1.3163 0.2048
quadrupole: -10.1654 10.0492 0.1162 4.0011 1.3163 0.2048
hfenergy: -2617.5256408 hartree
pointgroup: C01 [X(C6H2Cl4O2S1)]
dipole: -1.7483245 -0.759106 -0.0536546 debye
dipolederiv: -0.0567057 -0.1914379 0.0089187 -0.1220378 -0.4448775 0.0323125 -0.0074885 0.0058309 0.0508877 -0.3992425 -0.0253648 -0.0894727 -0.1115003 -0.241922 -0.1643857 -0.3007616 -0.1491732 -0.6844864 -0.2910641 0.2882294 -0.0096814 0.3691722 -0.3539271 0.0078534 0.0169421 -0.0066916 0.0279268 -0.7908513 -0.1622286 0.0093724 -0.1382774 -0.0613391 0.0043248 0.0298503 0.0083238 0.0003919 1.9261254 -0.0855838 0.1444219 0.1055782 0.9791024 0.1974537 0.167221 0.1603854 1.5708897 -0.6082825 0.009942 -0.0048779 -0.0376019 -0.3502996 0.0740848 0.0582701 0.021005 -0.5238515 -0.6191414 0.0357476 -0.0107938 0.0508617 -0.5313462 -0.1087739 0.0321242 -0.0256958 -0.4197581 -0.2805147 -0.0209353 0.0250946 0.0096793 -0.2042394 0.0090719 0.1527338 0.0172678 -0.1408258 0.1202183 0.5396286 -0.0443179 -0.0331176 0.6510173 -0.0654141 -0.0386431 -0.0301403 -0.007791 -0.0972722 -0.0575339 -0.0331534 0.3559364 -0.0696953 0.0173552 -0.1019671 -0.0004546 -0.0916223 0.072782 -0.7546177 0.0185969 -0.7098063 0.3599663 0.0106035 0.0095012 0.0255516 -0.0113678 -0.3717065 0.0575071 -0.0050065 0.0107624 -0.0028285 -0.0096131 0.015043 -0.0030431 -0.0741099 1.2222202 0.3492194 -0.0303642 0.2665828 0.1113844 -0.0154314 -0.059637 -0.0182788 -0.0291251 0.1368615 0.0463081 0.0215467 0.001388 0.1229039 0.0069169 -0.0029078 -0.0077052 0.158395 0.0365736 -0.0288802 -0.0002835 -0.0176198 0.0361002 0.0036417 0.0297193 0.0028179 0.174447 unknown
polarizability: 196.0013303|5.1492089|146.0521355|6.4560016|5.5685921|88.7759249 unknown
InChI: InChI=1S/C6H2Cl3O2S.Cl/c7-3-1-2-4(12(10)11)6(9)5(3)8;/h1-2H;
charge 0 multiplicity 1
15 atoms
Cl 0.43618 2.466663 -0.097648
Cl 2.950048 0.567799 1.970004
Cl -2.757492 2.075478 0.017513
Cl -3.991858 -0.921872 0.114849
S  2.435989 -0.254387 -0.227496
O  2.942399 0.826268 -1.312424
O  2.94804 -1.787742 -0.296357
C  0.538562 -0.333186 -0.104537
C  -0.269079 0.819982 -0.074686
C  0.017727 -1.636532 -0.048808
C  -1.676708 0.64684 -0.011976
C  -1.378484 -1.798558 0.016176
C  -2.213634 -0.663407 0.032846
H  0.691237 -2.498329 -0.061951
H  -1.819028 -2.797717 0.053296
