program: Gaussian 09
title: 000036931
version: EM64L-G09RevD.01
frameworkgroup: C1[X(C17H21BrN2)]
method: RPBEPBE
basis: SDD
operation: Freq
keyword: #p
keyword: freq=noraman
keyword: PBEPBE/SDD
title: #p freq=noraman PBEPBE/SDD
converged: YES YES NO NO
title: Mulliken charges:
elementType: Br N N C C C C C C C C C C C C C C C C C H H H H H H H H H H H H H H H H H H H H H
charge: -0.013467 -0.431658 -0.015558 0.135936 -0.477260 -0.436238 -0.410613 -0.466472 -0.094070 0.254843 0.284638 -0.116919 -0.327888 -0.429778 -0.270664 -0.316161 -0.340380 -0.297605 -0.201324 -0.681539 0.233790 0.205599 0.207682 0.206055 0.201681 0.213679 0.243095 0.230870 0.291653 0.212284 0.215048 0.193299 0.208025 0.214490 0.268181 0.201067 0.213933 0.251581 0.208696 0.223878 0.207591
chargesum: 0.00000
title: Mulliken charges with hydrogens summed into heavy atoms:
elementType: Br N N C C C C C C C C C C C C C C C C C
charge: -0.013467 -0.140005 -0.015558 0.135936 -0.037871 -0.022501 0.004747 0.007493 -0.094070 0.254843 0.284638 -0.116919 0.099444 -0.028454 -0.056174 -0.047980 0.074621 -0.297605 0.050257 -0.041374
polarizability: 3.20400559e+02 9.65637027e-01 2.30493525e+02 2.69299761e+00 -2.49999397e+01 1.26448522e+02
1716.lowfreq: -17.6133 -0.0006 -0.0006 0.0004 2.4029 4.4476 9.5330 33.5995 42.8399
frequency: -13.2111 33.5351 42.8337 71.1737 81.4146 95.4259 107.0120 131.5687 150.7229 177.3409 190.9927 219.2269 230.9921 238.3898 266.0314 290.9039 304.3607 324.2150 338.5275 353.7704 407.5606 435.3247 441.4396 456.9152 492.4104 506.1522 516.5355 552.9896 606.4242 610.3016 637.8239 650.4607 681.6132 695.3393 737.5413 770.9002 818.2237 823.5238 829.1099 834.1267 844.2672 859.5548 870.0201 895.9954 908.1399 927.2128 955.5304 973.8496 981.3668 986.3128 1029.8082 1065.8901 1069.0250 1079.5623 1094.2988 1109.8623 1120.0400 1130.4932 1134.1888 1150.6048 1163.9075 1181.3957 1219.1751 1233.5646 1245.5999 1251.3995 1257.7286 1277.9250 1282.3616 1292.8427 1306.8845 1326.3110 1333.6715 1339.6669 1345.0333 1350.8140 1360.3345 1389.6283 1395.2064 1395.8158 1400.9204 1420.1212 1450.8195 1453.2603 1460.8889 1468.7750 1472.2002 1475.2878 1475.4752 1479.5302 1482.3659 1487.7263 1504.1868 1540.0563 1568.2815 1601.0419 2952.4132 2957.3248 2967.6293 2975.0986 2977.8811 2978.3231 2979.3752 2981.9603 3009.9371 3016.1950 3034.2683 3038.1462 3041.3500 3049.6541 3051.9281 3070.6646 3078.1435 3145.7076 3155.3035 3176.9321 3541.1176
redmass: 3.4880 5.1900 4.0448 2.3131 2.4953 2.9536 3.5145 3.0106 4.1323 4.0385 3.4162 4.6615 1.4388 2.1878 2.6516 2.7771 3.2980 2.1825 3.9422 4.9617 4.8285 3.9113 2.6997 2.9247 2.5212 1.5747 3.5586 3.8053 3.2593 4.4102 4.8682 5.4460 4.7585 4.3423 1.1369 2.4914 4.0333 1.9200 1.6190 1.6874 1.6009 1.7624 3.3020 2.0982 1.7405 2.6783 1.3456 1.3394 1.9777 2.3538 3.9234 2.1375 2.6385 1.9137 1.6004 2.0893 1.8059 1.7339 1.3286 2.2818 1.6867 2.3944 1.3210 2.2166 1.2876 1.3018 1.3764 1.4078 1.8564 1.3296 1.3063 1.8068 1.4725 1.4429 1.3911 1.6580 1.5568 3.8091 1.9440 1.5955 5.2784 3.1876 1.4359 1.2981 1.1325 1.2630 1.1570 1.0680 1.1030 1.0431 1.1218 1.0922 2.6579 5.6521 5.3569 6.7289 1.0627 1.0633 1.0664 1.0364 1.0650 1.0603 1.0609 1.0652 1.0956 1.0946 1.1010 1.0947 1.1002 1.0994 1.1011 1.1008 1.0991 1.0903 1.0879 1.0980 1.0746
irintensity: 0.3331 0.1498 0.3983 0.3032 0.1150 0.4948 0.3231 0.7472 0.5148 2.9104 0.7934 1.9401 0.3888 1.6560 1.5200 2.0952 0.2453 1.4951 4.5051 4.7978 1.4105 0.5068 5.0301 5.9300 12.4673 78.6261 7.1796 19.3801 4.2196 11.9299 11.4155 19.9564 10.8113 1.7487 7.5877 1.6619 7.2936 2.7832 5.7584 52.8675 2.9462 5.3044 15.9612 9.3614 6.0258 24.8816 8.0170 0.6039 7.3935 1.4770 4.5416 15.7131 10.0515 0.2436 2.1203 9.5909 5.1534 6.4417 4.6699 37.6960 2.7831 7.6057 3.7909 0.2656 3.8124 1.7819 5.3516 3.1621 0.8551 0.9491 0.7556 10.2127 2.2161 3.0551 16.3021 1.4725 23.6128 6.3986 59.4088 23.8582 69.3088 14.0890 8.9666 60.4335 8.0714 30.2077 19.1887 14.6441 3.4415 12.6040 64.0261 21.0523 204.9838 70.7185 75.7377 9.4077 18.5829 12.7428 87.9060 43.2997 41.9062 47.7506 32.0556 13.3104 8.4108 23.7247 39.6116 39.3157 59.4500 13.3117 77.2631 83.4841 38.4450 9.4562 0.1096 7.9223 11.9341
temp: 298.150 k
press: 1.00000 atm
elementType: 35 7 7 6 6 6 6 6 6 6 6 6 6 6 6 6 6 6 6 6 1 1 1 1 1 1 1 1 1 1 1 1 1 1 1 1 1 1 1 1 1
symmnumber: 1
zpe: 898447.7 jmol-1
zpe.correction: 0.342201 hartree
zpe.thermalcorrener: 0.360581 hartree
zpe.thermalcorrenthalpy: 0.361525 hartree
zpe.thermalcorrgfe: 0.294941 hartree
zpe.sumelectzpe: -781.912263 hartree
zpe.sumelectthermal: -781.893883 hartree
zpe.sumelectthermalent: -781.892939 hartree
zpe.sumelectthermalfe: -781.959523 hartree
dipole: 2.3211 3.9254 -0.5877
dipole: 4.5980
quadrupole: -127.0605 -122.6725 -131.7104
quadrupole: 3.7933 -1.0160 -1.2043
quadrupole: 0.0873 4.4753 -4.5626 3.7933 -1.0160 -1.2043
hfenergy: -782.2544634 hartree
pointgroup: C01 [X(C17H21Br1N2)]
dipole: 1.0856332 -1.4353114 0.1837082 debye
polarizability: 319.1628509|7.6937854|231.341726|-8.4992982|-25.5411975|126.83803 unknown
InChI: InChI=1S/C17H21BrN2/c1-2-3-10-19-17-13-6-4-5-7-15(13)20-16-9-8-12(18)11-14(16)17/h8-9,11,19H,2-7,10H2,1H3
charge 0 multiplicity 1
41 atoms
Br -5.01687 0.076114 0.591643
N  0.29137 -1.629159 0.987506
N  0.604724 2.354729 -0.547815
C  1.681021 0.261799 0.199859
C  2.982639 -0.442852 0.578881
C  4.181431 0.5224 0.694692
C  4.268223 1.397627 -0.572446
C  3.021911 2.301161 -0.662775
C  1.708272 1.596475 -0.338674
C  0.419613 -0.331796 0.475457
C  -0.783639 0.457536 0.256823
C  -0.6251 1.80711 -0.235515
C  1.030902 -2.831301 0.538585
C  0.070115 -4.023818 0.321608
C  -2.106675 -0.042133 0.487123
C  -1.788302 2.620777 -0.42879
C  -0.884823 -3.854253 -0.883087
C  -3.207512 0.787556 0.28067
C  -3.070728 2.131838 -0.170665
C  -1.874994 -5.02991 -1.025542
H  2.825685 -0.980851 1.534146
H  3.243563 -1.21742 -0.171217
H  4.063258 1.173797 1.583757
H  5.11085 -0.06056 0.838761
H  4.333237 0.741376 -1.463773
H  5.182014 2.020703 -0.564287
H  2.92221 2.759184 -1.664147
H  3.122911 3.149333 0.043786
H  -0.58888 -1.83813 1.460776
H  1.537737 -2.599088 -0.415296
H  1.812552 -3.118046 1.27109
H  -0.519242 -4.194207 1.248672
H  0.680718 -4.937882 0.178768
H  -2.277003 -1.075906 0.803419
H  -1.631996 3.64158 -0.790188
H  -0.281701 -3.760095 -1.808601
H  -1.447449 -2.904602 -0.786601
H  -3.954602 2.758173 -0.319652
H  -2.516225 -5.120774 -0.128378
H  -2.536966 -4.893091 -1.899502
H  -1.339549 -5.989692 -1.15367
