program: Gaussian 09
title: 000037094
version: EM64L-G09RevD.01
frameworkgroup: C1[X(C24H28N4O3S)]
method: RPBEPBE
basis: SDD
operation: Freq
keyword: #p
keyword: freq=noraman
keyword: PBEPBE/SDD
title: #p freq=noraman PBEPBE/SDD
converged: YES YES NO NO
title: Mulliken charges:
elementType: S O O O N N N N C C C C C C C C C C C C C C C C C C C C C C C C H H H H H H H H H H H H H H H H H H H H H H H H H H H H
charge: 0.986398 -0.266736 -0.535006 -0.485571 -0.385361 -0.610805 -0.057797 -0.041687 -0.050542 -0.527702 -0.120894 0.464998 -0.700114 -0.696283 -0.673308 0.382343 0.487447 -0.061122 0.224565 -0.722484 -0.414846 -0.394148 -0.411131 -0.422702 -0.253150 -0.179924 0.096550 -0.404051 -0.412630 -0.191636 -0.234004 -0.260604 0.213046 0.206630 0.210705 0.259779 0.210716 0.213501 0.221229 0.199879 0.237903 0.220248 0.253914 0.239992 0.329358 0.216230 0.260470 0.209393 0.254933 0.259990 0.292548 0.294117 0.255220 0.257275 0.362047 0.259153 0.246292 0.226140 0.226889 0.234342
chargesum: 0.00000
title: Mulliken charges with hydrogens summed into heavy atoms:
elementType: S O O O N N N N C C C C C C C C C C C C C C C C C C C C C C C C
charge: 0.986398 -0.266736 -0.535006 -0.485571 -0.056003 -0.248759 -0.057797 -0.041687 0.162504 -0.110368 0.138885 0.464998 -0.054668 -0.038252 -0.179402 0.382343 0.487447 -0.061122 0.224565 -0.036391 -0.159913 -0.134158 -0.155912 -0.165428 0.039398 0.114193 0.096550 -0.144898 -0.166339 0.034504 -0.007115 -0.026262
polarizability: 3.71864143e+02 -1.03384084e+01 3.20203695e+02 1.76070379e+01 1.42079231e+01 2.75455576e+02
1716.lowfreq: -14.1548 -9.7665 -6.5978 0.0010 0.0012 0.0019 3.4475 5.8152 12.5819
frequency: -13.0087 -8.7056 12.4657 24.2631 30.7205 33.7795 40.9846 45.0627 48.0946 50.6179 59.9229 71.9163 88.0898 104.7492 114.0595 137.5798 146.6361 168.5800 186.5354 202.4537 207.3857 212.6694 223.9790 227.9607 241.3944 270.9965 289.8103 290.9919 303.3084 309.2547 319.0330 332.2495 357.2106 375.3860 393.6093 398.4561 402.1814 403.8792 406.1228 412.3973 417.8636 446.2061 465.8730 486.1176 517.1251 522.9252 536.7324 552.4678 572.0840 591.5464 600.5404 616.5500 618.8666 627.6695 633.8553 672.0315 704.7913 728.5116 729.8301 754.1502 770.6141 781.2260 797.9848 804.2925 811.1936 816.5742 842.0710 856.9857 859.8976 863.4387 874.9636 886.6694 916.2053 923.8404 928.1894 929.8306 945.8455 950.7650 957.2654 958.6699 959.3133 968.3194 981.3225 982.0810 989.9597 994.0356 999.2365 1004.8525 1019.8221 1042.7031 1051.6863 1068.8175 1081.2362 1099.4876 1109.1423 1126.3665 1126.6918 1157.9677 1159.5848 1172.0403 1172.8355 1186.5877 1192.9550 1205.8584 1206.9300 1220.0029 1226.3485 1235.4192 1262.8022 1278.0863 1284.4682 1297.5349 1302.1458 1304.2000 1317.8990 1324.2543 1330.6765 1343.3191 1358.4198 1375.6578 1379.6681 1380.3313 1385.9367 1386.4466 1397.1542 1399.5935 1435.7671 1437.0899 1456.2235 1461.1863 1466.7734 1468.1366 1472.5728 1473.0397 1480.0045 1481.5029 1483.8413 1487.7533 1489.2335 1504.4946 1566.2785 1588.4941 1590.4883 1593.1127 1613.6311 1618.3225 2961.7260 2969.2228 2971.0447 2975.1779 2979.5741 2989.9090 3012.0123 3030.5097 3060.9944 3068.3440 3073.4990 3077.9909 3086.3082 3086.7642 3102.0823 3120.3612 3121.9709 3127.6500 3128.1352 3131.3334 3140.1611 3141.4632 3153.9694 3163.4077 3166.3685 3181.5955 3494.5693 3524.1010
redmass: 3.3444 4.0457 5.4439 5.7986 4.5143 4.1076 5.5918 5.7979 5.3461 3.3170 4.6864 4.7564 5.2924 6.7739 4.8013 4.7418 5.9736 6.1134 5.1266 1.1092 4.3045 3.3124 3.4211 4.0002 1.7875 5.7459 2.8150 1.3056 3.3191 3.5813 3.4629 2.9422 4.4107 4.1240 6.1367 3.3937 2.9661 2.9069 2.6823 2.9342 2.8884 4.1645 4.8854 3.8177 1.8206 3.0466 2.8166 2.8422 1.9563 2.0922 5.2068 6.1530 6.5336 4.7108 5.0822 3.9774 1.9076 3.0381 3.3399 2.0118 5.2571 2.5609 6.1867 3.7160 2.9426 6.9462 1.3415 1.2548 1.7442 4.4459 1.5694 2.4102 1.1920 1.5342 1.7493 2.0426 1.7468 2.3746 5.0879 1.7999 1.3679 1.5533 1.3925 1.3841 5.8911 5.5855 1.3231 3.9464 2.3466 1.6123 2.4606 2.2275 1.5521 1.9631 1.4542 2.0300 2.3176 2.1029 1.3468 1.3135 1.3642 1.1378 1.1201 1.9495 2.4981 1.4418 1.8714 2.1304 4.4704 1.5395 1.3696 1.9488 1.3071 1.4964 1.3027 1.3835 1.5327 1.2457 2.1364 1.7753 1.2775 5.3362 3.0780 1.6097 1.2153 2.6953 2.3173 4.8632 1.2082 1.0848 1.4081 1.0601 1.6692 1.0703 1.3971 1.0643 2.1168 1.0535 1.1190 5.4975 5.1986 6.2538 6.0436 7.3242 6.2956 7.1627 1.0805 1.0369 1.0469 1.0512 1.0817 1.0367 1.0629 1.1022 1.0991 1.0986 1.0995 1.0989 1.0994 1.0999 1.0998 1.0865 1.0921 1.0935 1.0869 1.0897 1.0908 1.0921 1.0949 1.0954 1.1008 1.0952 1.0770 1.0780
irintensity: 0.0476 1.0466 0.7989 0.5502 0.4060 0.4299 2.0174 5.0648 1.2381 0.2977 0.2147 2.0631 0.4299 1.9583 2.0055 1.4585 3.6122 1.3130 1.6041 0.3382 1.4859 0.9030 3.2862 11.0653 1.3028 5.2830 1.9767 1.1414 11.6884 3.9122 1.0011 2.6220 20.1328 2.9691 28.4922 4.7198 4.6432 0.5784 0.9984 4.9645 0.6799 52.3103 72.1050 1.2470 26.9046 76.7842 30.5871 76.2228 56.5423 20.2391 24.2945 1.0183 0.3341 18.4278 14.9934 13.3223 28.5998 108.2069 75.3125 53.8166 4.4379 17.9658 8.7402 17.3566 5.9888 132.1575 4.5446 2.0149 16.3621 27.5142 2.8820 0.6949 5.6907 6.0336 15.2962 3.5442 0.1213 6.1475 48.9170 13.6083 0.1566 3.1461 0.2149 0.4271 0.3111 1.3920 0.4135 9.0568 12.9486 0.8040 24.1316 8.2439 7.7908 6.1433 4.5217 5.0354 3.0784 21.8655 19.3412 8.5990 12.8890 16.4338 2.0022 5.6313 4.3080 6.3728 56.5339 3.2544 6.8286 21.4145 0.9579 19.6315 1.5473 1.6573 6.0219 6.6575 0.4516 1.9779 7.4656 4.4465 11.7752 5.2648 11.2324 20.4333 17.8919 11.3237 89.3576 608.4836 135.5159 1.6407 77.9650 2.2347 24.1699 7.9617 91.1457 13.6474 12.8688 29.8014 30.7676 32.6612 89.9949 51.4876 2.0296 4.0790 62.6999 179.3908 6.2412 34.7914 26.8998 50.3703 7.5810 21.6172 16.5338 13.9135 17.5881 55.7696 32.7923 57.2236 4.4682 28.2837 16.0717 3.6010 15.4354 28.3045 0.2844 8.5939 3.2117 18.1849 34.7626 4.9628 14.0013 5.0672 79.9920 18.2712
temp: 298.150 k
press: 1.00000 atm
elementType: 16 8 8 8 7 7 7 7 6 6 6 6 6 6 6 6 6 6 6 6 6 6 6 6 6 6 6 6 6 6 6 6 1 1 1 1 1 1 1 1 1 1 1 1 1 1 1 1 1 1 1 1 1 1 1 1 1 1 1 1
symmnumber: 1
zpe: 1251745.1 jmol-1
zpe.correction: 0.476765 hartree
zpe.thermalcorrener: 0.507175 hartree
zpe.thermalcorrenthalpy: 0.508119 hartree
zpe.thermalcorrgfe: 0.412701 hartree
zpe.sumelectzpe: -1771.600318 hartree
zpe.sumelectthermal: -1771.569908 hartree
zpe.sumelectthermalent: -1771.568964 hartree
zpe.sumelectthermalfe: -1771.664382 hartree
dipole: 1.1189 -5.4492 1.3545
dipole: 5.7255
quadrupole: -178.1062 -227.9306 -199.3706
quadrupole: -18.7693 -15.1305 -11.1448
quadrupole: 23.6963 -26.1281 2.4318 -18.7693 -15.1305 -11.1448
hfenergy: -1772.077083 hartree
pointgroup: C01 [X(C24H28N4O3S1)]
dipole: 1.4147842 1.6948593 0.4471083 debye
polarizability: 308.4051749|-10.9453838|348.7811701|-40.3130711|26.1303401|310.3370695 unknown
InChI: InChI=1S/C24H28N4O3S/c1-17(2)13-20-15-25-24(26-16-20)28-32(30,31)22-11-9-19(10-12-22)14-23(29)27-18(3)21-7-5-4-6-8-21/h4-12,15-18,27-28H,13-14H2,1-3H3
charge 0 multiplicity 1
60 atoms
S  -2.681089 -2.82102 0.82523
O  3.040835 -1.205916 -4.38616
O  -2.523065 -4.077068 1.84575
O  -4.092653 -2.486525 0.109019
N  3.04564 -1.374225 -2.066709
N  -2.13031 -1.419684 1.922733
N  -2.416729 0.285727 0.302071
N  -2.417581 0.768778 2.700203
C  -1.572588 4.92279 0.922054
C  -2.876251 4.069004 0.800784
C  3.784144 -0.105271 -1.839424
C  -2.683975 2.594077 1.085963
C  -1.920213 6.427104 0.834869
C  -0.531022 4.532192 -0.150816
C  1.86681 -3.123416 -3.359066
C  3.346389 0.481668 -0.488995
C  0.720401 -3.111204 -2.360639
C  -1.317295 -2.923645 -0.465792
C  2.703028 -1.816419 -3.326611
C  5.304063 -0.317944 -2.008088
C  0.768439 -3.889879 -1.174742
C  -0.397681 -2.26175 -2.584784
C  -2.602868 1.614893 0.063368
C  -2.56923 2.090353 2.409626
C  -0.257177 -3.803376 -0.205722
C  -1.434162 -2.155936 -1.635464
C  -2.34077 -0.077326 1.620803
C  1.960221 0.556561 -0.179104
C  4.276702 0.965259 0.463869
C  1.519747 1.087355 1.052105
C  3.837038 1.505283 1.695055
C  2.458402 1.565419 1.996323
H  -1.132314 4.724647 1.922404
H  -3.287007 4.200818 -0.220285
H  -3.62933 4.482293 1.501123
H  3.456034 0.572245 -2.654569
H  -2.373537 6.668886 -0.14583
H  -2.637792 6.724101 1.622694
H  -1.013688 7.049434 0.947241
H  -0.933184 4.712284 -1.167029
H  -0.241601 3.468424 -0.079222
H  0.388963 5.134933 -0.041703
H  1.499662 -3.213168 -4.394891
H  2.541871 -3.978905 -3.169283
H  2.720447 -1.891464 -1.246151
H  5.845707 0.643977 -1.962665
H  5.49551 -0.7651 -2.997501
H  5.708758 -0.989409 -1.229532
H  1.608814 -4.573641 -1.005849
H  -0.448057 -1.669965 -3.505791
H  -0.244552 -4.40333 0.709759
H  -2.291479 -1.4927 -1.776424
H  -2.689611 1.903462 -0.991182
H  -2.624795 2.763395 3.274204
H  -2.175639 -1.692512 2.91383
H  1.2225 0.190956 -0.904176
H  5.350055 0.919111 0.254706
H  0.44786 1.120805 1.2776
H  4.572723 1.872332 2.419665
H  2.118381 1.973532 2.954543
