program: Gaussian 09
title: 000036912
version: EM64L-G09RevD.01
frameworkgroup: C1[X(C14H26N2O)]
method: RPBEPBE
basis: SDD
operation: Freq
keyword: #p
keyword: freq=noraman
keyword: PBEPBE/SDD
title: #p freq=noraman PBEPBE/SDD
converged: YES YES NO NO
title: Mulliken charges:
elementType: O N N C C C C C C C C C C C C C C H H H H H H H H H H H H H H H H H H H H H H H H H H
charge: -0.458673 -0.152445 -0.086747 -0.153561 -0.033835 -0.133228 -0.078917 -0.157206 -0.434962 -0.439708 -0.425390 -0.370259 -0.359068 -0.782041 -0.452203 -0.457765 -0.612117 0.240142 0.229580 0.190575 0.195500 0.200467 0.199855 0.188272 0.181411 0.245423 0.213811 0.179076 0.182979 0.212698 0.222826 0.179716 0.231397 0.184282 0.292746 0.203589 0.220702 0.224840 0.201593 0.329947 0.226225 0.190233 0.220242
chargesum: 0.00000
title: Mulliken charges with hydrogens summed into heavy atoms:
elementType: O N N C C C C C C C C C C C C C C
charge: -0.128726 -0.152445 -0.086747 0.086581 0.195745 0.057347 0.116583 0.043261 -0.046835 -0.012874 -0.032504 0.025418 0.043474 -0.073616 -0.027912 -0.031332 0.024583
polarizability: 1.81378513e+02 -1.99766090e+00 1.51489128e+02 6.29623387e-01 -2.22542519e+00 1.48486993e+02
1716.lowfreq: -25.7879 -20.7144 -0.0004 -0.0003 0.0006 2.6145 10.4055 52.5820 96.8440
frequency: -18.7099 52.3957 96.8331 103.4787 125.5852 135.6647 165.3850 192.4355 209.7079 211.1195 225.5559 242.2513 263.7391 271.4530 298.0490 308.6207 329.8977 339.2094 354.2805 389.5421 401.7922 429.6822 482.8465 576.0514 613.3221 631.8911 635.7165 680.4149 716.3530 764.7872 777.3544 782.7669 833.0874 853.4546 869.3988 887.9211 907.6020 910.7025 934.4590 945.2772 954.7623 970.0554 978.9530 1008.1272 1012.6195 1038.2255 1058.1513 1068.2342 1080.2048 1087.0198 1090.0539 1104.0251 1111.0540 1119.5557 1122.5846 1135.9846 1147.7902 1163.2273 1170.1533 1189.5070 1193.4802 1206.2451 1220.9203 1229.0132 1243.4725 1250.6091 1266.0908 1275.9232 1282.7009 1287.4107 1290.6278 1305.5596 1316.7593 1321.0145 1330.8141 1338.3006 1346.0177 1355.2863 1360.3481 1364.9211 1367.5049 1375.4126 1379.5965 1383.6127 1397.9534 1431.0888 1447.2547 1454.3993 1459.6050 1462.7662 1465.0192 1476.6948 1478.3107 1482.7302 1484.5627 1493.0119 1515.3151 2788.2446 2808.4686 2826.2430 2835.2149 2843.5248 2847.8169 2921.4900 2947.1549 2953.4515 2966.7409 2982.0566 2994.5663 3006.2856 3007.6929 3012.9687 3016.0962 3020.2101 3026.7863 3037.6570 3053.0829 3062.0507 3064.2778 3067.4052 3086.7339 3087.5017 3558.5358
redmass: 1.7923 3.6405 2.3649 2.9634 3.0426 2.4580 3.3974 1.5515 1.5082 1.7579 2.1495 2.2780 1.1039 3.1596 2.9119 2.9129 2.0212 2.2890 2.4289 4.5210 2.6426 3.0720 3.6074 4.1095 3.7108 3.0233 3.5904 2.8283 3.2330 3.3857 2.7027 1.7954 2.3474 1.5419 2.6575 2.3203 2.7494 2.0989 1.9575 1.8986 3.1261 1.5622 2.0323 2.0919 2.6486 2.2330 1.8552 2.5878 1.6793 1.5896 1.8568 1.5332 1.8829 2.2282 1.6779 2.2320 1.8106 1.7997 1.4450 1.3737 1.2712 1.2733 1.6099 1.3221 1.5253 1.6296 1.2744 1.4540 1.2436 1.3057 1.7844 1.5310 1.2891 1.4473 1.5803 1.4452 1.3591 1.3772 1.3683 1.3403 1.3776 1.4156 1.4084 1.3395 1.4539 1.1634 1.0615 1.0662 1.0567 1.0816 1.0759 1.0864 1.0790 1.0943 1.0677 1.0997 1.0545 1.0716 1.0711 1.0716 1.0792 1.0720 1.0582 1.0835 1.0785 1.0822 1.0396 1.0663 1.0851 1.0591 1.0712 1.0852 1.0835 1.0656 1.1016 1.0863 1.0895 1.1027 1.0969 1.1009 1.1051 1.0987 1.0660
irintensity: 0.0194 0.5487 0.9882 0.0997 1.4057 0.2702 1.6717 3.0242 1.6214 1.2176 2.9348 1.6391 126.2025 4.6562 10.0440 3.1183 0.4200 5.3028 4.0826 3.7631 7.6333 0.9834 3.7928 10.6045 5.6654 0.7337 2.3017 5.2275 7.7953 12.6918 0.9800 1.9790 10.8529 4.2120 8.7534 4.1692 8.3091 2.1543 1.4996 4.9594 6.6058 3.7510 1.9661 24.3432 66.3316 24.8244 15.7358 2.9856 5.4480 0.1943 10.4699 25.1637 12.3823 20.4884 0.9619 40.9977 16.8042 2.7901 47.2775 6.6489 8.1387 13.1670 7.0792 5.1421 13.5904 9.5067 3.1456 4.8640 13.1972 2.8062 14.3413 1.7644 8.2414 0.9483 15.4396 2.2209 2.5524 1.6035 0.1564 2.9055 12.1751 1.9906 10.8205 18.0065 0.6365 1.4907 2.8326 11.1233 22.0046 2.2197 2.3482 12.6681 1.5402 12.1695 9.6816 1.4206 0.7646 93.5060 104.9888 60.6148 6.4170 197.2694 197.0218 78.6145 17.6574 82.5053 70.4536 82.1461 65.0043 27.9117 42.7965 16.2123 45.7294 56.8023 33.9444 63.9421 16.2383 4.0700 21.1928 38.0847 72.6792 14.9699 2.5753
temp: 298.150 k
press: 1.00000 atm
elementType: 8 7 7 6 6 6 6 6 6 6 6 6 6 6 6 6 6 1 1 1 1 1 1 1 1 1 1 1 1 1 1 1 1 1 1 1 1 1 1 1 1 1 1
symmnumber: 1
zpe: 1009187.6 jmol-1
zpe.correction: 0.384379 hartree
zpe.thermalcorrener: 0.400627 hartree
zpe.thermalcorrenthalpy: 0.401571 hartree
zpe.thermalcorrgfe: 0.342383 hartree
zpe.sumelectzpe: -732.392773 hartree
zpe.sumelectthermal: -732.376525 hartree
zpe.sumelectthermalent: -732.375581 hartree
zpe.sumelectthermalfe: -732.434769 hartree
dipole: 1.7204 -0.2330 -0.7986
dipole: 1.9109
quadrupole: -95.4257 -104.3451 -106.4718
quadrupole: -2.7418 -0.9605 -2.6481
quadrupole: 6.6551 -2.2643 -4.3909 -2.7418 -0.9605 -2.6481
hfenergy: -732.7771524 hartree
pointgroup: C01 [X(C14H26N2O1)]
dipole: 0.6832762 -0.0629803 -0.3072465 debye
polarizability: 181.44544|-1.130729|151.5264638|1.0925471|-2.1320426|148.3827309 unknown
InChI: InChI=1S/C14H26N2O/c1-10-7-11-8-15(2)9-12(14(11)17)13(10)16-5-3-4-6-16/h10-14,17H,3-9H2,1-2H3
charge 0 multiplicity 1
43 atoms
O  1.269634 -2.592273 -1.163669
N  -1.809606 0.060652 0.010649
N  1.880913 1.537472 -0.07149
C  0.442807 -0.295321 -1.076346
C  -0.526619 -0.697963 0.075322
C  2.450007 -0.889566 0.275803
C  0.102265 -0.650269 1.513921
C  1.697457 -1.185708 -1.038117
C  1.556067 -1.233801 1.499715
C  0.912735 1.181096 -1.130337
C  2.964745 0.568997 0.169291
C  -2.472991 0.086176 -1.324878
C  -2.861303 -0.490779 0.912714
C  0.02068 0.716501 2.237281
C  -3.905084 0.602786 -1.026524
C  -4.154274 0.2383 0.474689
C  2.351004 2.924893 -0.170604
H  -0.074652 -0.499969 -2.032641
H  -0.740218 -1.781345 -0.124274
H  3.356465 -1.531547 0.332995
H  -0.495555 -1.361552 2.123514
H  2.352947 -0.924946 -1.900672
H  1.485615 -2.339488 1.533158
H  2.073575 -0.920809 2.428343
H  1.347494 1.360678 -2.15128
H  0.034238 1.845698 -1.023891
H  3.482184 0.854982 1.106737
H  3.738196 0.599579 -0.647745
H  -2.519142 -0.938503 -1.778433
H  -1.931348 0.741201 -2.029399
H  -2.610848 -0.316992 1.972455
H  -2.970478 -1.597934 0.766961
H  -1.002437 1.127463 2.199369
H  0.311629 0.593137 3.299149
H  0.696526 1.440103 1.752422
H  -4.644772 0.137751 -1.701873
H  -3.96092 1.69548 -1.170795
H  -4.300851 1.153736 1.073457
H  -5.044156 -0.400593 0.613865
H  2.075958 -3.167617 -1.154007
H  1.486141 3.612585 -0.201569
H  2.974241 3.117206 -1.082096
H  2.960332 3.181402 0.715729
