program: Gaussian 09
title: 000036906
version: EM64L-G09RevD.01
frameworkgroup: C1[X(C12H16N2O)]
method: RPBEPBE
basis: SDD
operation: Freq
keyword: #p
keyword: freq=noraman
keyword: PBEPBE/SDD
title: #p freq=noraman PBEPBE/SDD
converged: YES YES NO NO
title: Mulliken charges:
elementType: O N N C C C C C C C C C C C C H H H H H H H H H H H H H H H H
charge: -0.271551 -0.405436 -0.596287 -0.568198 0.396293 0.134151 -0.060968 0.214419 -0.438497 -0.566541 -0.704304 -0.322740 0.305818 -0.347844 -0.537342 0.227861 0.195126 0.204293 0.268701 0.301527 0.243596 0.201338 0.219397 0.233294 0.227350 0.267274 0.258938 0.246366 0.241316 0.216637 0.216013
chargesum: 0.00000
title: Mulliken charges with hydrogens summed into heavy atoms:
elementType: O N N C C C C C C C C C C C C
charge: -0.271551 -0.103909 -0.070075 -0.145212 0.396293 0.134151 0.143324 0.214419 -0.169796 -0.322946 -0.050274 -0.095390 0.305818 -0.101477 0.136624
polarizability: 1.86084724e+02 -1.07059408e+01 1.69284743e+02 1.20714299e+01 5.12542046e+00 9.01995203e+01
1716.lowfreq: -5.9307 -0.0004 0.0002 0.0006 7.2397 8.6269 33.4510 56.3975 65.0007
frequency: 33.3542 56.3794 64.9877 93.2617 149.8948 157.8319 187.4492 213.5488 242.2590 251.1746 266.6630 305.6637 333.4577 368.3619 386.0538 423.3213 430.3891 444.4381 479.4437 485.3902 509.2645 574.2830 592.8272 598.7471 644.8203 700.2120 745.8514 763.1988 789.4635 803.7642 815.5107 835.3102 847.1334 886.4231 909.8220 933.3076 958.3105 996.4397 997.1267 1041.1972 1070.5543 1096.3738 1113.6091 1126.9211 1134.0962 1155.5527 1190.0059 1210.9805 1221.8537 1242.9798 1252.4759 1284.0296 1303.6598 1316.9670 1346.8233 1370.3035 1385.8349 1395.4561 1421.7978 1437.2976 1458.7200 1462.2121 1463.3632 1470.3148 1476.5206 1477.2845 1478.4176 1560.7901 1594.3418 1631.8291 1633.2156 2863.4337 2947.5039 2951.6407 2975.2045 3030.4463 3037.6870 3065.5865 3092.2699 3116.6354 3134.9243 3155.4273 3170.3090 3219.0385 3443.6494 3573.1263 3616.1849
redmass: 2.9898 3.3851 3.7061 3.5115 3.8444 2.8034 3.3527 1.1656 1.2179 1.3377 1.9909 3.5434 3.0904 3.6157 4.4528 2.8388 3.3617 2.0900 2.0732 1.7652 3.7333 2.5619 1.8393 2.5001 3.5896 4.4825 3.9592 3.5163 1.6568 1.5461 4.3120 1.8184 2.3811 1.6175 3.5317 1.3291 1.9753 1.5360 4.4426 2.1826 2.0703 1.4720 1.2626 1.9382 1.2948 1.3833 2.6641 1.6791 1.4185 2.3067 1.3927 1.5019 2.3486 1.9599 1.4328 1.5512 1.3043 4.7350 1.8797 1.5382 1.1018 2.9913 1.0519 1.0533 1.1523 1.2008 2.6734 6.2868 6.4300 1.3280 3.3595 1.0822 1.0337 1.0654 1.0365 1.1034 1.0948 1.0984 1.0992 1.0985 1.0893 1.0906 1.0955 1.0982 1.0446 1.0975 1.0809
irintensity: 0.5865 1.1165 1.2233 9.4618 0.0232 2.2584 4.9647 8.2053 1.8737 28.8481 6.1081 1.9701 21.4120 1.6299 2.6007 2.6875 3.2460 19.7306 49.3293 56.5701 1.4286 82.0959 85.9125 65.8616 10.6149 6.3373 0.5880 5.8808 52.2505 19.9219 13.5787 32.3484 7.1174 1.9123 17.7978 0.0158 2.6738 0.1029 41.1293 7.5972 13.1164 34.3272 0.2244 28.0492 7.2350 0.0401 110.1318 39.4038 10.2915 15.8636 11.0116 6.6097 13.0209 16.3165 28.6440 2.7690 27.9916 25.0601 32.4367 10.5199 4.0357 54.4547 13.3167 6.8225 12.7934 1.8546 92.7121 2.6234 25.9125 30.8475 48.2181 91.6397 54.0226 54.1092 32.4626 55.7464 23.6165 39.4428 32.8947 31.1913 13.3996 10.5246 9.1478 1.1838 1.9447 0.0704 61.5270
temp: 298.150 k
press: 1.00000 atm
elementType: 8 7 7 6 6 6 6 6 6 6 6 6 6 6 6 1 1 1 1 1 1 1 1 1 1 1 1 1 1 1 1
symmnumber: 1
zpe: 678844.8 jmol-1
zpe.correction: 0.258558 hartree
zpe.thermalcorrener: 0.273417 hartree
zpe.thermalcorrenthalpy: 0.274361 hartree
zpe.thermalcorrgfe: 0.216576 hartree
zpe.sumelectzpe: -650.473115 hartree
zpe.sumelectthermal: -650.458256 hartree
zpe.sumelectthermalent: -650.457312 hartree
zpe.sumelectthermalfe: -650.515097 hartree
dipole: -0.8171 0.1676 0.2823
dipole: 0.8806
quadrupole: -98.7432 -63.4482 -93.7748
quadrupole: 0.7212 -2.1398 1.9797
quadrupole: -13.4211 21.8739 -8.4527 0.7212 -2.1398 1.9797
hfenergy: -650.7316734 hartree
pointgroup: C01 [X(C12H16N2O1)]
dipole: -0.3223913 -0.071896 -0.1044703 debye
polarizability: 185.6666436|10.3241346|169.6687136|-13.6512717|1.7947635|90.2336301 unknown
InChI: InChI=1S/C12H16N2O/c1-8(13)5-9-7-14-12-4-3-10(15-2)6-11(9)12/h3-4,6-8,14H,5,13H2,1-2H3
charge 0 multiplicity 1
31 atoms
O  3.165091 1.714201 -0.270332
N  -0.191241 -2.730497 0.187483
N  -3.731027 2.15286 0.194573
C  -2.306267 0.283068 0.919485
C  -1.242921 -0.734833 0.593176
C  0.151594 -0.47288 0.272339
C  -2.794255 1.119004 -0.302173
C  0.785409 -1.738864 0.023599
C  -1.406221 -2.121139 0.532415
C  0.918575 0.723937 0.183634
C  -3.518955 0.244427 -1.341796
C  2.155201 -1.838225 -0.311165
C  2.2841 0.617418 -0.148244
C  2.89791 -0.649691 -0.395719
C  2.609471 3.042819 -0.030137
H  -3.196411 -0.20235 1.361778
H  -1.921079 0.990074 1.685589
H  -1.889426 1.554696 -0.794962
H  -2.301234 -2.713912 0.714529
H  -0.038634 -3.731259 0.090708
H  0.447748 1.692852 0.374573
H  -3.836637 0.845057 -2.216052
H  -4.420187 -0.207787 -0.88824
H  -2.855357 -0.560016 -1.703051
H  2.635276 -2.804703 -0.500441
H  -4.211968 2.672454 -0.546945
H  -3.331884 2.776498 0.904425
H  3.961653 -0.662809 -0.651199
H  3.448781 3.740055 -0.172525
H  2.21788 3.138066 1.00263
H  1.801617 3.280877 -0.751157
