program: Gaussian 09
title: 000036885
version: EM64L-G09RevD.01
frameworkgroup: C1[X(C12H17N2O)]
method: RPBEPBE
basis: SDD
operation: Freq
keyword: #p
keyword: freq=noraman
keyword: PBEPBE/SDD
title: #p freq=noraman PBEPBE/SDD
converged: YES YES NO NO
title: Mulliken charges:
elementType: O N N C C C C C C C C C C C C H H H H H H H H H H H H H H H H H
charge: -0.267824 -0.136269 -0.378487 0.059056 0.285939 -0.240855 -0.376142 0.252261 -0.055860 -0.695923 -0.270746 -0.303235 -0.691737 -0.202765 -0.182201 0.188754 0.231977 0.219206 0.212245 0.223920 0.313276 0.375297 0.238824 0.243831 0.215327 0.273339 0.269771 0.200408 0.228971 0.242010 0.262559 0.265075
chargesum: 1.00000
title: Mulliken charges with hydrogens summed into heavy atoms:
elementType: O N N C C C C C C C C C C C C
charge: -0.267824 -0.136269 -0.003189 0.247809 0.285939 0.210328 0.060023 0.252261 0.257416 0.002058 0.002594 -0.033464 -0.020349 0.059794 0.082874
polarizability: 1.73370025e+02 1.12733358e+01 1.59755905e+02 1.27003545e+01 -1.15279408e+01 8.96772573e+01
1716.lowfreq: -10.9898 -7.0284 -0.0006 0.0003 0.0004 4.2023 26.2968 35.1010 45.2889
frequency: 25.8209 34.9996 45.1333 91.0496 102.7515 162.0549 204.7065 207.2794 218.7228 223.0896 244.5354 259.9286 343.1489 391.9875 417.0923 449.3894 472.1646 483.7896 533.5575 567.6605 593.0116 622.5503 693.8496 719.4476 748.9777 759.4571 765.4090 775.7828 819.4180 841.6355 858.2228 864.3407 879.5893 957.3140 964.3296 988.1070 1003.1742 1010.9805 1019.6554 1037.4877 1042.5600 1082.8683 1106.2999 1120.6940 1125.1489 1158.3606 1175.8122 1178.8977 1196.8065 1239.8261 1266.0730 1272.3683 1294.5607 1302.4933 1324.6708 1346.9331 1360.2228 1390.0130 1393.0593 1400.8609 1408.7670 1423.1227 1451.3446 1459.5508 1472.0393 1473.3042 1479.2209 1479.6365 1487.0925 1495.8727 1541.1853 1616.8669 1630.0523 2931.2642 2952.5074 2980.7998 2987.6570 2999.5772 3007.0956 3050.3005 3078.5545 3079.6396 3094.4020 3097.8171 3161.5800 3170.6832 3183.4374 3193.3189 3264.0735 3578.1923
redmass: 3.2980 3.8444 3.8310 3.0719 2.4663 2.5761 1.6772 1.7612 2.6020 2.0091 1.6616 3.1615 3.7916 3.0061 2.9013 3.2446 2.9721 2.9420 5.7655 3.4919 4.5503 3.6767 1.1664 3.5918 3.8523 3.7219 1.3189 1.9837 1.9463 1.5537 2.0540 1.4956 5.2834 1.3638 1.3528 1.4387 1.3481 2.0897 5.0913 2.2950 2.9519 3.2080 1.7242 2.3052 1.6820 1.2740 1.6254 1.3343 1.1932 2.2901 1.2177 1.4590 1.3747 2.9326 1.2434 1.6174 1.6604 1.2330 1.2128 1.3181 2.9632 4.3170 1.0763 2.4567 1.0819 1.0528 1.0974 1.1681 1.0510 2.0537 4.2701 7.1115 7.0827 1.0845 1.0556 1.0381 1.0381 1.0606 1.1067 1.0996 1.0988 1.0988 1.0999 1.1001 1.0881 1.0918 1.0970 1.1000 1.1028 1.0835
irintensity: 0.6757 0.0768 1.3089 2.5955 3.7553 0.7766 1.2908 1.5818 9.6103 3.8715 3.0136 0.5581 2.8625 1.7506 13.4622 2.2954 0.8732 5.8071 0.9010 2.4313 4.6502 2.8134 96.8635 0.6876 1.8850 5.5910 143.6260 13.7213 33.7598 2.6998 31.3828 5.0029 14.0903 1.1086 14.8632 2.2098 0.3576 2.7474 224.4561 23.5411 30.7415 2.7793 34.2201 5.1443 9.4913 5.5918 9.1595 2.2088 25.5788 13.9319 2.3403 13.4256 6.1284 24.7360 25.4094 19.3736 4.4659 11.2883 6.6206 60.7834 9.3775 4.7113 6.9059 11.6362 19.3788 9.1938 7.3573 12.2927 13.4476 4.0942 77.0936 16.7609 4.3397 40.8480 39.1233 25.2077 10.5132 22.2429 23.5648 1.4060 46.6939 22.7713 41.3104 27.6938 0.4613 0.9064 1.0732 0.5377 34.5439 176.0322
temp: 298.150 k
press: 1.00000 atm
elementType: 8 7 7 6 6 6 6 6 6 6 6 6 6 6 6 1 1 1 1 1 1 1 1 1 1 1 1 1 1 1 1 1
symmnumber: 1
zpe: 714224.9 jmol-1
zpe.correction: 0.272034 hartree
zpe.thermalcorrener: 0.286660 hartree
zpe.thermalcorrenthalpy: 0.287604 hartree
zpe.thermalcorrgfe: 0.229039 hartree
zpe.sumelectzpe: -650.852562 hartree
zpe.sumelectthermal: -650.837935 hartree
zpe.sumelectthermalent: -650.836991 hartree
zpe.sumelectthermalfe: -650.895557 hartree
dipole: 4.4796 -4.5658 -0.6013
dipole: 6.4245
quadrupole: -42.8979 -58.4872 -86.1917
quadrupole: -5.4443 9.3611 -5.6114
quadrupole: 19.6277 4.0384 -23.6661 -5.4443 9.3611 -5.6114
hfenergy: -651.1245955 hartree
pointgroup: C01 [X(C12H17N2O1)]
dipole: 1.7681616 -1.7741378 -0.3389043 debye
polarizability: 171.3919661|9.6641176|161.2853322|19.44531|-2.2153406|90.1258891 unknown
InChI: InChI=1S/C12H17N2O/c1-3-10(2)15-9-14-8-13-11-6-4-5-7-12(11)14/h4-8,10,13H,3,9H2,1-2H3
charge 1 multiplicity 1
32 atoms
O  -1.908739 -0.508454 0.086487
N  0.267348 -1.254008 -0.342239
N  2.14735 -1.991698 0.571728
C  -3.195623 0.052463 -0.470869
C  1.114555 -0.124357 -0.194804
C  -1.116098 -1.232088 -0.868499
C  -3.723304 1.003536 0.612784
C  2.328713 -0.601632 0.382434
C  0.909354 -2.350402 0.138029
C  -4.172768 -1.079676 -0.821571
C  0.928049 1.237328 -0.505086
C  3.413308 0.254647 0.657479
C  -2.810505 2.218412 0.875646
C  2.012335 2.094368 -0.233869
C  3.230663 1.613474 0.333465
H  -2.928458 0.63115 -1.385418
H  -1.103202 -0.735199 -1.862483
H  -1.436765 -2.286189 -0.994316
H  -4.725812 1.347644 0.293755
H  -3.867579 0.423455 1.544112
H  0.495565 -3.354491 0.171842
H  2.830674 -2.635675 0.973805
H  -4.403733 -1.684262 0.073004
H  -5.118756 -0.652034 -1.198589
H  -3.782821 -1.749274 -1.610449
H  -0.011712 1.616207 -0.913343
H  4.346823 -0.105125 1.098982
H  -2.693324 2.836572 -0.035407
H  -1.810264 1.895342 1.213546
H  -3.239654 2.865522 1.660048
H  1.916787 3.161291 -0.455952
H  4.041791 2.321453 0.527048
