program: Gaussian 09
title: 000000738
version: EM64L-G09RevD.01
frameworkgroup: C1[X(C5H10N2O3)]
method: RPBEPBE
basis: SDD
operation: Freq
keyword: #p
keyword: freq=noraman
keyword: PBEPBE/SDD
title: #p freq=noraman PBEPBE/SDD
converged: YES YES NO NO
title: Mulliken charges:
elementType: O O O N N C C C C C H H H H H H H H H H
charge: -0.406024 -0.243675 -0.262557 -0.574198 -0.619701 -0.348956 -0.225065 -0.544923 0.151241 0.234851 0.236400 0.257075 0.265236 0.264398 0.225069 0.278445 0.286264 0.314040 0.334640 0.377441
chargesum: 0.00000
title: Mulliken charges with hydrogens summed into heavy atoms:
elementType: O O O N N C C C C C
charge: -0.028583 -0.243675 -0.262557 -0.009489 0.028979 0.144519 0.040171 -0.055456 0.151241 0.234851
polarizability: 8.39274700e+01 -3.91239970e+00 7.80689455e+01 -2.92083078e+00 7.07010293e+00 6.65646199e+01
1716.lowfreq: -0.0011 -0.0010 -0.0009 2.7301 7.5936 15.6323 30.4532 38.9839 47.1255
frequency: 30.3285 38.8899 47.1153 108.6498 135.5201 199.4708 219.8039 241.4826 313.9608 372.0114 418.7164 490.4022 497.5970 524.8807 579.3769 600.7145 635.0831 661.2852 683.1671 733.9838 745.2920 819.5522 870.2291 914.8977 1025.7808 1031.0073 1046.0971 1073.2471 1144.4448 1155.8583 1191.5303 1229.8958 1262.0950 1286.5210 1295.3478 1344.9510 1371.7298 1375.6814 1450.3069 1462.5106 1596.8145 1644.2285 1647.3035 1654.8357 2976.8064 3014.7187 3038.7395 3053.8318 3084.5472 3448.9254 3497.2872 3516.6792 3569.7242 3673.9680
redmass: 5.8273 8.7247 4.7399 2.6646 3.9625 4.0867 1.3669 2.8895 2.6140 3.7223 2.8118 1.6059 2.1870 1.6494 1.9040 2.0749 1.8768 1.8230 1.5859 4.4447 2.0202 1.9437 3.0248 2.9288 2.0993 2.8399 1.9793 1.7973 2.6049 1.3274 1.4204 1.4746 1.5588 1.2169 1.8642 1.6402 1.9137 1.5377 1.0832 1.0972 1.4205 3.6939 7.6526 1.0993 1.0605 1.0600 1.0987 1.0855 1.1040 1.0454 1.0640 1.0446 1.0965 1.1043
irintensity: 13.1641 0.8700 3.9486 0.6493 14.3904 4.1094 37.8162 16.0124 21.5300 13.9910 9.6820 51.4935 21.5574 149.3131 72.9560 63.9621 70.8325 41.7815 258.5718 12.2195 13.4066 27.6742 7.3377 4.5262 34.1937 190.6328 44.0334 3.3028 16.9275 1.7641 12.1724 1.7225 30.8808 33.6826 15.2039 65.8296 88.6536 4.6080 3.4715 28.8257 61.9599 195.4924 300.0529 35.9097 10.2930 11.6744 12.3172 17.2300 18.8493 0.6940 13.8363 28.3931 3.0392 22.1851
temp: 298.150 k
press: 1.00000 atm
elementType: 8 8 8 7 7 6 6 6 6 6 1 1 1 1 1 1 1 1 1 1
symmnumber: 1
zpe: 418979.0 jmol-1
zpe.correction: 0.159581 hartree
zpe.thermalcorrener: 0.171047 hartree
zpe.thermalcorrenthalpy: 0.171991 hartree
zpe.thermalcorrgfe: 0.120570 hartree
zpe.sumelectzpe: -530.928413 hartree
zpe.sumelectthermal: -530.916946 hartree
zpe.sumelectthermalent: -530.916002 hartree
zpe.sumelectthermalfe: -530.967424 hartree
dipole: 0.3756 2.5911 1.2919
dipole: 2.9195
quadrupole: -47.8998 -58.8888 -63.4483
quadrupole: -10.2465 -8.6689 -0.9807
quadrupole: 8.8458 -2.1432 -6.7027 -10.2465 -8.6689 -0.9807
hfenergy: -531.0879932 hartree
pointgroup: C01 [X(C5H10N2O3)]
dipole: -0.2468209 0.5361939 -0.9853644 debye
dipolederiv: -0.4845918 -0.1062474 0.2692117 -0.1400803 -0.4996052 0.4635791 0.2566971 0.3593845 -0.9140117 -0.4351986 -0.1581683 -0.0924622 -0.1931753 -0.592944 -0.2250219 0.0028574 -0.012422 -0.9008198 -0.6803101 0.12898 -0.1080468 0.0538829 -0.4997529 0.2703049 0.0740859 0.2151599 -0.8916326 -0.4429238 -0.2101024 -0.0484209 -0.0832619 -0.7309854 0.1552526 -0.1236533 0.177208 -0.3684777 -0.8129411 -0.2068075 0.4927424 -0.142621 -0.6175209 -0.1074573 0.3479018 -0.0622083 -0.7613662 0.1356123 0.0662873 -0.0276676 -0.059656 0.0213281 0.0328362 -0.0903926 0.0528697 0.0617273 0.1501728 -0.1459486 0.0558923 -0.1060606 0.3682666 -0.1417886 0.0695158 -0.2681693 0.2629505 -0.4129659 0.1248472 -0.0185473 0.1181644 0.1258171 -0.0202773 -0.117214 0.002176 -0.0340196 0.4029339 0.4236339 -0.1210627 0.5752905 0.7846556 -0.0645632 -0.1920477 -0.1717253 1.4076166 1.3129864 -0.0843472 -0.3520229 -0.0635001 0.3876041 -0.3889699 -0.2964622 -0.3968889 1.258051 -0.0180871 -0.0889157 -0.0194017 -0.0585141 -0.0637455 -0.0877934 0.0141672 -0.0653373 0.0497641 0.1106073 0.0151445 -0.0063934 0.0008778 0.0169781 0.089033 0.0204916 0.0643652 -0.0011281 0.0150053 0.047448 0.0745144 0.0383305 0.0224372 -0.0403349 0.0685527 -0.0259068 -0.0454474 0.072487 -0.044322 -0.043012 -0.0309353 -0.032339 -0.0615208 -0.0205421 -0.0434355 0.0456852 0.061579 -0.0128081 0.0225295 -0.0037705 -0.0129434 0.1167319 0.0318236 0.1021692 -0.0544366 0.0039433 0.1566976 -0.0017966 0.0242955 0.3199402 0.0190885 0.0052658 0.0491719 0.1526055 0.2992447 0.0841832 -0.0367544 0.0767719 0.2138546 -0.1316664 0.0131648 -0.0430365 0.0841617 0.2096005 0.0513781 -0.0208705 0.0512571 0.3137106 0.1043111 -0.0189427 0.0986127 0.180579 0.1530326 0.0593506 0.0083426 0.0418975 0.3313129 0.084221 0.018475 0.0804059 0.2029563 0.3598132 -0.1002834 -0.0267738 -0.0991932 0.1439308 -0.0659648 -0.0637441 -0.1123932 0.2652425 unknown
polarizability: 82.8272684|0.225091|67.4131699|-5.4752582|-7.681537|78.3205972 unknown
InChI: InChI=1S/C5H10N2O3/c6-3(5(9)10)1-2-4(7)8/h3,9H,1-2,6-7H2
charge 0 multiplicity 1
20 atoms
O  -2.37445 -1.239129 1.365897
O  -2.247003 -1.102054 -0.9504
O  2.640512 -0.989768 0.897955
N  -1.567589 1.724648 -0.655876
N  3.320462 -0.19973 -1.17132
C  0.168645 0.517591 0.692742
C  -1.3481 0.761917 0.434553
C  0.9401 0.0477 -0.557751
C  -2.03222 -0.592394 0.173994
C  2.35863 -0.418032 -0.196164
H  0.59164 1.47431 1.047571
H  0.301208 -0.226443 1.498672
H  -1.773995 1.173417 1.365961
H  0.42314 -0.815291 -1.025294
H  0.975096 0.85539 -1.312788
H  -2.476303 2.196829 -0.609337
H  -1.415214 1.31447 -1.584767
H  3.106975 0.276645 -2.045547
H  4.270518 -0.529631 -1.00084
H  -2.759752 -2.136146 1.166538
