program: Gaussian 09
title: 000036872
version: EM64L-G09RevD.01
frameworkgroup: C1[X(C3H6BrCl)]
method: RPBEPBE
basis: SDD
operation: Freq
keyword: #p
keyword: freq=noraman
keyword: PBEPBE/SDD
title: #p freq=noraman PBEPBE/SDD
converged: NO YES NO NO
title: Mulliken charges:
elementType: Br Cl C C C H H H H H H
charge: 0.031445 -0.000877 -0.300166 -0.575897 -0.654289 0.255395 0.234646 0.329913 0.229093 0.238013 0.212724
chargesum: 0.00000
title: Mulliken charges with hydrogens summed into heavy atoms:
elementType: Br Cl C C C
charge: 0.031445 -0.000877 0.189875 -0.245984 0.025541
polarizability: 7.83713674e+01 -4.53732870e+00 5.47961393e+01 -2.24014356e+00 -1.02701148e+00 3.64850582e+01
1716.lowfreq: -2.6188 -0.0032 -0.0022 -0.0018 8.5173 13.2570 108.1676 187.4531 203.6530
frequency: 108.1446 187.4502 203.6527 224.3574 294.1796 369.2100 581.4732 634.7649 806.5906 904.8751 1034.1845 1070.3786 1112.1395 1174.1020 1220.8336 1282.5313 1332.9142 1393.6250 1452.9490 1473.7514 1485.7534 2990.9911 3004.5032 3065.1882 3088.3302 3104.6508 3123.4166
redmass: 1.9715 3.8933 6.9765 1.2926 4.6961 2.8269 4.1189 4.7824 1.2315 1.9695 1.9942 1.6009 2.2795 1.1150 1.2980 1.1326 1.3909 1.1947 1.0762 1.0410 1.0541 1.0362 1.0624 1.0987 1.0994 1.1002 1.0900
irintensity: 0.3539 0.4396 0.1595 1.0379 9.2106 5.6864 30.6551 106.8366 30.3434 27.7041 3.5599 14.2347 3.0679 31.3774 5.0838 12.8016 6.1206 14.9811 9.1282 15.4295 14.6371 27.5064 8.7787 0.8953 32.4466 21.6375 10.4842
temp: 298.150 k
press: 1.00000 atm
elementType: 35 17 6 6 6 1 1 1 1 1 1
symmnumber: 1
zpe: 219663.9 jmol-1
zpe.correction: 0.083666 hartree
zpe.thermalcorrener: 0.090251 hartree
zpe.thermalcorrenthalpy: 0.091195 hartree
zpe.thermalcorrgfe: 0.051555 hartree
zpe.sumelectzpe: -591.019330 hartree
zpe.sumelectthermal: -591.012745 hartree
zpe.sumelectthermalent: -591.011801 hartree
zpe.sumelectthermalfe: -591.051441 hartree
dipole: -1.7231 -2.0497 0.6294
dipole: 2.7507
quadrupole: -46.5457 -48.2952 -46.2907
quadrupole: 2.3194 -0.3824 0.0691
quadrupole: 0.4982 -1.2513 0.7532 2.3194 -0.3824 0.0691
hfenergy: -591.1029958 hartree
pointgroup: C01 [X(C3H6Br1Cl1)]
dipole: 0.928691 0.4795961 0.2805395 debye
dipolederiv: -0.6399547 0.2617977 0.0052173 0.2422855 -0.2974895 0.0050737 -0.0624606 0.0521879 -0.1073355 -0.2350128 0.01881 0.0091769 0.0764308 -0.7660002 -0.0654799 0.0431175 -0.1445986 -0.1586862 -0.1507613 0.0181412 0.0368618 0.0680992 -0.119239 0.03029 -0.0885825 0.0196636 0.0399772 1.0020524 -0.3105536 0.0177072 -0.3434427 1.1685741 0.0816102 0.012677 0.0866387 0.2215266 -0.0852954 0.0345482 -0.0009465 -0.1031764 0.0414392 0.0161336 0.0905181 0.0080628 0.0866757 0.0484162 0.0037574 -0.0468782 0.0044382 0.1084666 -0.0086253 -0.0256213 0.0204363 -0.0932481 0.0275491 -0.0106805 0.0031528 0.0234001 -0.1064609 -0.054159 0.028422 -0.0454706 0.08764 -0.0505988 0.0462349 -0.066523 0.0216115 -0.0582148 -0.004962 0.0018729 0.0009308 -0.051553 -0.1057052 -0.0784254 0.0572775 -0.0885452 0.0240856 0.0666056 0.0672499 0.0699521 0.0662166 0.1068691 -0.000141 -0.0158455 0.076544 -0.0887432 -0.0633015 0.0000239 -0.0703754 0.0746078 0.0824415 0.0165111 0.0007995 0.0223548 0.093582 -0.0031854 -0.0672168 0.0025724 -0.1658211 unknown
polarizability: 71.859194|-11.583438|61.1969973|2.1665392|1.287948|36.5963735 unknown
InChI: InChI=1S/C3H6BrCl/c1-2-3(4)5/h3H,2H2,1H3
charge 0 multiplicity 1
11 atoms
Br -2.141681 0.908827 -0.006621
Cl -0.443999 -1.791076 -0.197731
C  0.778897 0.747094 -0.285632
C  -0.37128 -0.003522 0.37818
C  2.164454 0.174749 0.092476
H  0.636978 0.733031 -1.380867
H  0.707914 1.803849 0.03742
H  -0.313648 -0.051985 1.47418
H  2.958246 0.792103 -0.363543
H  2.279503 -0.86061 -0.26961
H  2.319315 0.17764 1.187248
