program: Gaussian 09
title: 000036930
version: EM64L-G09RevD.01
frameworkgroup: C1[X(C17H21ClN2)]
method: RPBEPBE
basis: SDD
operation: Freq
keyword: #p
keyword: freq=noraman
keyword: PBEPBE/SDD
title: #p freq=noraman PBEPBE/SDD
converged: YES YES NO NO
title: Mulliken charges:
elementType: Cl N N C C C C C C C C C C C C C C C C C H H H H H H H H H H H H H H H H H H H H H
charge: -0.073991 -0.432513 -0.016313 0.139407 -0.478162 -0.434875 -0.411263 -0.467313 -0.092120 0.249940 0.294313 -0.314084 -0.128698 -0.107269 -0.302437 -0.309388 -0.690128 -0.695828 -0.184336 -0.239275 0.233751 0.203963 0.207434 0.205819 0.201405 0.213971 0.242901 0.230979 0.287360 0.207568 0.210624 0.193587 0.221714 0.267504 0.219125 0.208234 0.235695 0.221885 0.208128 0.215574 0.257110
chargesum: 0.00000
title: Mulliken charges with hydrogens summed into heavy atoms:
elementType: Cl N N C C C C C C C C C C C C C C C C C
charge: -0.073991 -0.145153 -0.016313 0.139407 -0.040448 -0.021621 0.004113 0.006567 -0.092120 0.249940 0.294313 0.104108 -0.128698 0.086318 -0.080723 -0.041884 -0.027074 -0.050241 -0.184336 0.017836
polarizability: 2.96426051e+02 -1.88444972e+00 2.35962158e+02 -8.30384810e-01 -2.00158468e+01 1.22674941e+02
1716.lowfreq: -13.3676 -9.1795 -0.0019 0.0015 0.0015 5.0325 18.2826 32.6714 42.2511
frequency: 15.9713 32.5576 42.1406 64.8865 79.4766 102.5067 133.8660 149.3665 178.6070 187.9325 191.9698 219.1349 236.0453 268.7989 279.3675 288.8024 325.5481 331.2281 355.1495 373.9349 393.1311 420.6006 429.9649 445.1121 457.0092 502.0561 503.7271 519.2252 552.4656 602.5471 610.2806 640.6504 659.5995 681.9002 697.8412 769.2908 813.1247 823.3648 828.6061 833.8036 852.5942 866.4756 889.3625 909.1998 915.2298 921.0214 934.4510 946.4571 961.8788 969.4763 986.8585 1027.0740 1072.1836 1079.2217 1094.8895 1116.9596 1125.4567 1132.1945 1140.3362 1153.9277 1164.4864 1180.1299 1183.6626 1231.7075 1239.6142 1250.6322 1257.9957 1276.3445 1281.2716 1305.5861 1325.2994 1330.1496 1338.2648 1340.3680 1349.8778 1353.1481 1378.9500 1388.8732 1393.4276 1399.8505 1402.1913 1423.3869 1449.6187 1456.3219 1464.9587 1466.6556 1467.9292 1472.0946 1477.0974 1481.8054 1482.0242 1487.8133 1505.3135 1543.1349 1569.3428 1606.0061 2941.0424 2951.3777 2960.1239 2972.0663 2976.1251 2977.2078 2979.7689 2980.5982 3016.9615 3038.2302 3041.9120 3050.9918 3055.7836 3063.8066 3071.9667 3076.5229 3080.2887 3142.9231 3156.0279 3177.5838 3536.8859
redmass: 2.8318 3.7009 4.3083 3.8273 2.8582 2.6410 3.6608 5.4236 3.4473 2.4935 1.4033 2.2237 1.2397 3.8162 3.5022 3.4937 4.6490 2.0703 5.5101 2.4206 2.3082 4.0814 2.4707 3.9949 3.5278 1.7630 1.9739 4.0080 3.9117 4.0113 4.4976 4.0731 5.7724 4.9595 4.6355 2.5064 2.9928 3.5501 1.5457 1.7673 1.8318 3.2654 1.9483 1.6157 1.2582 1.7531 2.0092 1.8368 1.6270 1.3384 2.7089 3.8054 2.1231 1.8856 1.5922 1.6778 2.6076 1.1999 2.1173 2.0850 1.6620 1.9260 2.3246 2.3317 1.2732 1.2819 1.4194 1.4155 1.9830 1.5804 1.8037 1.4538 1.4771 1.4256 1.5065 1.5320 1.2133 3.7166 2.0568 1.6306 4.5984 3.2032 1.1906 1.5232 1.2952 1.1325 1.0779 1.0949 1.1004 1.0876 1.0826 1.0563 2.9078 5.8064 5.6487 6.9227 1.0832 1.0635 1.0664 1.0358 1.0368 1.0645 1.0614 1.0650 1.0943 1.0944 1.1001 1.1023 1.0967 1.0995 1.0982 1.1000 1.0990 1.0905 1.0880 1.0981 1.0746
irintensity: 0.2172 0.1248 0.3734 0.0980 0.1760 0.8660 0.6945 0.2630 2.3400 1.7682 0.4820 2.0570 0.6157 3.2172 0.9344 0.7554 1.4492 0.9393 4.9789 4.5189 2.1394 1.8379 1.0167 3.7786 1.3301 53.6945 40.7106 9.7800 16.6417 3.2134 9.2817 9.7234 18.1918 12.2376 6.2288 1.2133 2.0944 9.8283 16.6122 45.8939 5.1355 12.1977 6.7692 4.6780 6.6857 16.4212 18.9091 5.8246 1.6120 0.6234 8.2145 10.6837 21.9813 0.3580 0.4388 11.0999 26.7904 2.5501 3.2218 28.4395 3.3843 14.5870 2.6711 2.6120 7.1011 0.7114 4.0499 1.5899 0.2382 3.3585 4.6447 11.7261 3.7458 5.4471 11.8814 1.9701 9.2534 8.1223 94.6936 16.4172 49.2871 19.7000 29.0489 23.5707 17.1352 13.2905 16.0231 15.0825 2.8208 46.5785 13.3199 21.1534 276.3105 63.9925 61.3505 10.6275 28.1858 16.5734 85.5552 43.2951 20.1322 44.4269 31.9137 13.9654 25.4392 39.5107 62.1097 48.3932 15.3282 20.5954 69.6214 15.6769 64.7737 7.9950 0.3081 7.2173 12.4191
temp: 298.150 k
press: 1.00000 atm
elementType: 17 7 7 6 6 6 6 6 6 6 6 6 6 6 6 6 6 6 6 6 1 1 1 1 1 1 1 1 1 1 1 1 1 1 1 1 1 1 1 1 1
symmnumber: 1
zpe: 897859.4 jmol-1
zpe.correction: 0.341977 hartree
zpe.thermalcorrener: 0.361195 hartree
zpe.thermalcorrenthalpy: 0.362139 hartree
zpe.thermalcorrgfe: 0.293082 hartree
zpe.sumelectzpe: -1228.514977 hartree
zpe.sumelectthermal: -1228.495759 hartree
zpe.sumelectthermalent: -1228.494815 hartree
zpe.sumelectthermalfe: -1228.563871 hartree
dipole: 2.9779 3.4752 -0.4547
dipole: 4.5991
quadrupole: -127.8081 -120.7837 -129.1103
quadrupole: 2.4240 -0.6557 -0.8184
quadrupole: -1.9074 5.1170 -3.2096 2.4240 -0.6557 -0.8184
hfenergy: -1228.856954 hartree
pointgroup: C01 [X(C17H21Cl1N2)]
dipole: 1.7114953 -0.5631589 0.1661971 debye
polarizability: 278.7684562|27.5400471|253.6240024|9.482682|-17.6578347|122.6706911 unknown
InChI: InChI=1S/C17H21ClN2/c1-11(2)10-19-17-13-5-3-4-6-15(13)20-16-8-7-12(18)9-14(16)17/h7-9,11,19H,3-6,10H2,1-2H3
charge 0 multiplicity 1
41 atoms
Cl -4.212144 -2.777651 0.403843
N  1.044637 -1.266521 0.834735
N  -1.014179 2.255813 -0.461822
C  1.080693 1.124575 0.193011
C  2.555486 1.27964 0.561784
C  2.96916 2.75008 0.784293
C  2.525889 3.600016 -0.424211
C  0.986294 3.615306 -0.509214
C  0.32649 2.261579 -0.265844
C  0.395435 -0.103101 0.40128
C  -1.045489 -0.139698 0.199469
C  2.336502 -1.792012 0.343937
C  -1.699588 1.081706 -0.213676
C  2.228532 -3.288043 -0.058664
C  -1.837531 -1.321401 0.372486
C  -3.121479 1.089263 -0.392047
C  1.330344 -3.482685 -1.302139
C  3.641024 -3.872162 -0.292737
C  -3.216001 -1.259187 0.185325
C  -3.885556 -0.061751 -0.190931
H  2.758313 0.677835 1.468952
H  3.20685 0.865204 -0.235136
H  2.496255 3.145114 1.705703
H  4.064739 2.806858 0.929006
H  2.958237 3.167754 -1.34922
H  2.906502 4.63539 -0.344549
H  0.636364 3.99212 -1.488032
H  0.577195 4.318671 0.243611
H  0.453524 -1.969653 1.280895
H  3.132496 -1.682724 1.109604
H  2.643312 -1.209381 -0.542614
H  1.7730 -3.834854 0.797252
H  -1.385147 -2.284503 0.629646
H  -3.583295 2.033891 -0.694237
H  1.172121 -4.556021 -1.512548
H  1.803589 -3.02994 -2.194519
H  0.339379 -3.010761 -1.173305
H  3.582794 -4.939759 -0.571267
H  4.154168 -3.339349 -1.116338
H  4.271187 -3.789186 0.612405
H  -4.970605 -0.05647 -0.32629
