program: Gaussian 09
title: 000036887
version: EM64L-G09RevD.01
frameworkgroup: C1[X(C10H13N3O)]
method: RPBEPBE
basis: SDD
operation: Freq
keyword: #p
keyword: freq=noraman
keyword: PBEPBE/SDD
title: #p freq=noraman PBEPBE/SDD
converged: YES YES NO NO
title: Mulliken charges:
elementType: O N N N C C C C C C C C C C H H H H H H H H H H H H H
charge: -0.262049 -0.181905 -0.080112 -0.596307 0.315435 -0.271145 0.001403 -0.220710 -0.327917 -0.200955 -0.307428 -0.221714 -0.408967 -0.227525 0.205397 0.209152 0.257822 0.234712 0.182763 0.208703 0.248277 0.221655 0.223909 0.214322 0.225280 0.270280 0.287623
chargesum: 0.00000
title: Mulliken charges with hydrogens summed into heavy atoms:
elementType: O N N N C C C C C C C C C C
charge: -0.262049 -0.181905 -0.080112 -0.038404 0.315435 0.143404 0.001403 0.037112 -0.093205 0.190511 -0.059150 -0.000058 0.029265 -0.002245
polarizability: 1.68652240e+02 -1.36382693e+01 1.40349857e+02 -1.70708713e+01 -7.50008639e+00 8.02690651e+01
1716.lowfreq: -9.6550 -5.9286 -0.0006 -0.0002 0.0006 4.0334 16.3921 43.0488 50.0786
frequency: 16.1110 42.9682 50.0723 79.9422 133.7250 136.9365 162.0486 207.3366 221.7118 248.9271 314.3487 361.0596 420.7116 466.5632 483.4414 537.4261 560.1669 580.1150 606.2266 633.8013 750.4913 756.3232 766.7950 771.2644 803.3659 819.6821 856.9785 859.2925 918.5049 936.7793 959.2758 976.7570 1003.2791 1007.9540 1019.4830 1068.0957 1079.5413 1113.1360 1127.0945 1148.0840 1156.6767 1177.9651 1194.7289 1252.3015 1255.8914 1274.2199 1292.0931 1320.5820 1328.4339 1357.1543 1374.5843 1400.7552 1411.2044 1448.5391 1456.6474 1469.7271 1473.3320 1481.5305 1487.3835 1591.6225 1628.8001 1644.4875 2923.0415 2936.0782 2937.8634 2986.8594 2993.3214 3061.1941 3130.3121 3144.1283 3158.8758 3172.5745 3220.0513 3494.9383 3623.5206
redmass: 4.4532 2.5288 3.1323 3.2272 2.5201 4.2009 1.2332 3.6983 4.2496 2.8126 5.2269 3.8080 2.8199 4.1401 4.8126 5.5986 1.3533 3.9855 4.5659 4.2772 1.6393 2.9237 3.8602 4.7175 1.1030 1.4136 1.5681 6.0138 7.4477 1.3963 1.4316 1.3065 2.0233 2.3339 3.8460 3.7177 3.2067 2.5472 1.7935 1.2644 1.2778 1.5411 1.6135 1.3534 1.6701 1.6362 1.1042 1.2387 1.9709 5.5874 1.3493 2.6067 1.5345 3.1822 3.8616 1.6271 1.6126 1.1861 1.0876 7.0676 7.7613 1.0941 1.0585 1.0704 1.0561 1.1061 1.1011 1.0948 1.0853 1.0902 1.0961 1.0991 1.0981 1.0455 1.0988
irintensity: 0.0979 0.5560 0.3039 5.3784 1.2490 2.8379 56.1275 3.3977 2.9337 3.3257 1.3883 12.2021 10.5785 5.9211 5.4713 6.6696 244.1644 1.9755 5.1766 2.8092 77.4350 31.1718 7.8412 17.5584 2.8150 16.9021 4.2350 6.6009 27.6735 6.0029 13.4561 0.1795 49.4192 104.2368 150.9375 60.9098 5.7228 17.7445 8.2490 1.6356 3.5460 26.0970 39.3567 6.9903 39.9185 10.0802 4.7949 35.7914 36.7510 16.8184 17.0799 19.1606 53.3616 76.5315 29.7570 4.2032 10.4817 14.9504 8.8739 2.3832 10.0345 38.9784 40.5565 59.1151 95.3736 52.1643 39.5706 39.1221 0.7162 14.6475 25.0351 17.9172 0.6109 0.5660 3.3969
temp: 298.150 k
press: 1.00000 atm
elementType: 8 7 7 7 6 6 6 6 6 6 6 6 6 6 1 1 1 1 1 1 1 1 1 1 1 1 1
symmnumber: 1
zpe: 575805.9 jmol-1
zpe.correction: 0.219313 hartree
zpe.thermalcorrener: 0.232665 hartree
zpe.thermalcorrenthalpy: 0.233609 hartree
zpe.thermalcorrgfe: 0.176971 hartree
zpe.sumelectzpe: -627.276576 hartree
zpe.sumelectthermal: -627.263225 hartree
zpe.sumelectthermalent: -627.262280 hartree
zpe.sumelectthermalfe: -627.318918 hartree
dipole: -4.2617 -2.1454 1.8171
dipole: 5.1056
quadrupole: -75.4612 -78.4250 -83.5118
quadrupole: -3.6043 2.4209 1.7451
quadrupole: 3.6715 0.7077 -4.3792 -3.6043 2.4209 1.7451
hfenergy: -627.4958893 hartree
pointgroup: C01 [X(C10H13N3O1)]
dipole: 1.6455094 0.9372634 0.6698548 debye
polarizability: 169.4897212|-11.7488459|140.1296611|17.6070544|4.9264029|79.65178 unknown
InChI: InChI=1S/C10H13N3O/c11-5-6-14-8-13-7-12-9-3-1-2-4-10(9)13/h1-4,7H,5-6,8,11H2
charge 0 multiplicity 1
27 atoms
O  2.032686 -0.192274 -0.051553
N  -0.153293 -0.906354 0.521957
N  -1.931698 -2.046965 -0.376894
N  5.562593 0.959474 -0.392547
C  -1.149951 0.061834 0.283318
C  1.175943 -0.673622 1.034939
C  -2.256335 -0.669051 -0.267966
C  -0.683461 -2.137781 0.092202
C  -1.191677 1.455049 0.491858
C  3.391147 0.133714 0.418404
C  -3.448759 0.00712 -0.611065
C  -2.392008 2.111578 0.145434
C  4.205049 0.566804 -0.810544
C  -3.503055 1.399873 -0.396135
H  1.134037 0.080418 1.850991
H  1.573016 -1.625263 1.447818
H  -0.103452 -3.057726 0.153505
H  -0.335481 2.012483 0.885391
H  3.350138 0.955942 1.168814
H  3.871899 -0.746633 0.894949
H  -4.295023 -0.544716 -1.031264
H  -2.470124 3.19516 0.288125
H  4.277289 -0.292616 -1.500129
H  3.639125 1.361415 -1.345716
H  -4.413938 1.951207 -0.653732
H  5.640921 1.891785 0.019963
H  6.30371 0.761545 -1.066223
