program: Gaussian 09
title: 000037009
version: EM64L-G09RevD.01
frameworkgroup: C1[X(C23H28N2O2)]
method: RPBEPBE
basis: SDD
operation: Freq
keyword: #p
keyword: freq=noraman
keyword: PBEPBE/SDD
title: #p freq=noraman PBEPBE/SDD
converged: YES YES NO NO
title: Mulliken charges:
elementType: O O N N C C C C C C C C C C C C C C C C C C C C C C C H H H H H H H H H H H H H H H H H H H H H H H H H H H H
charge: -0.255516 -0.213974 -0.322263 -0.217756 -0.013348 -0.412168 0.089245 -0.481081 -0.420787 -0.346029 -0.425582 -0.271839 0.280987 0.057029 0.270488 -0.736385 -0.579620 -0.405552 -0.338413 -0.254859 0.516457 -0.222177 -0.452466 -0.346194 -0.217970 -0.228757 -0.243223 0.175914 0.207482 0.199600 0.230666 0.204755 0.185520 0.213598 0.206259 0.186418 0.252600 0.172515 0.210402 0.194451 0.218690 0.257354 0.222122 0.231962 0.234098 0.265608 0.256009 0.256035 0.229717 0.226683 0.232302 0.234279 0.228185 0.227570 0.230959
chargesum: 0.00000
title: Mulliken charges with hydrogens summed into heavy atoms:
elementType: O O N N C C C C C C C C C C C C C C C C C C C C C C C
charge: -0.255516 -0.213974 -0.069662 -0.217756 0.162566 -0.005086 0.089245 -0.045661 -0.021669 0.046648 -0.042665 0.141302 0.280987 0.057029 0.270488 -0.024946 -0.079914 -0.149543 -0.082378 -0.025142 0.516457 0.004506 -0.220164 -0.111915 0.010215 -0.001187 -0.012264
polarizability: 2.64760634e+02 -1.18923415e+01 2.73374524e+02 -1.80832643e+01 1.20734784e+01 2.34318465e+02
1716.lowfreq: -15.3768 -8.6275 -7.0841 -0.0006 -0.0003 -0.0001 5.5449 10.2972 16.6275
frequency: -10.3063 6.4806 15.7811 24.1955 35.9771 45.7919 67.6870 71.6794 103.4528 117.4444 133.7249 163.5249 171.3807 191.4239 194.4944 213.6001 221.7864 226.1829 232.2831 252.2855 287.1474 309.8361 319.2318 330.0133 351.9055 373.4585 403.6192 425.3799 434.3710 456.0571 468.1635 474.0603 476.6482 499.5176 532.6902 546.2448 568.3339 587.0691 615.2987 626.0399 656.3786 667.9486 689.4443 703.0366 719.9386 747.5414 754.7208 761.1100 776.2505 802.5564 811.9558 815.9843 834.1833 852.3504 853.1589 859.7293 867.8259 874.5500 907.4019 917.7581 919.9415 942.4440 977.3356 978.0560 980.8947 984.2854 990.3915 996.9509 1002.1122 1014.2008 1015.6473 1026.3020 1034.2885 1056.6493 1070.9863 1072.9512 1085.9306 1088.3962 1098.0463 1105.9348 1108.3504 1131.6534 1139.7886 1146.0558 1159.4702 1171.7258 1173.2330 1180.6095 1187.7658 1191.8499 1208.2609 1214.7076 1250.7032 1255.5898 1260.7384 1273.0775 1276.7826 1288.5077 1302.1022 1305.6020 1322.2840 1325.1927 1335.3716 1336.1383 1340.5571 1347.6501 1363.1900 1371.9183 1380.7066 1388.0324 1389.2250 1408.4088 1442.7768 1444.5118 1450.8406 1453.0522 1454.4179 1458.1070 1462.5361 1463.4530 1465.7043 1467.8740 1473.7330 1479.1413 1483.6776 1484.9833 1595.9271 1603.3670 1614.7806 1621.7934 1651.8720 2798.7710 2840.1345 2935.3378 2958.7068 2974.5803 2984.0996 2984.9180 2985.6071 2997.9304 2999.7455 3026.6615 3032.2148 3039.0422 3039.1806 3052.5324 3058.5080 3101.9219 3109.7234 3112.3063 3123.3647 3131.2743 3136.2452 3141.3401 3146.1626 3157.9927 3164.2409 3169.9338 3434.0991
redmass: 3.7038 4.3129 3.9160 4.0619 4.9013 4.6478 3.7810 4.5528 3.0070 3.4166 3.8883 3.8305 3.3927 3.5405 2.9581 1.4341 2.3020 2.1074 3.5347 3.9251 5.8886 2.4287 2.0543 3.8185 3.6268 3.7255 2.8041 3.1048 3.0978 3.3175 3.5914 2.3762 6.6516 2.9730 2.3091 3.9732 3.7347 3.4606 6.0648 5.0435 4.4622 1.7017 5.6144 1.9958 3.9168 2.0558 4.3935 1.3385 1.9419 3.5149 1.6103 3.1453 1.5019 2.3436 1.2666 2.3646 1.4497 2.5306 1.7196 1.4604 2.1156 1.3989 1.3949 2.2631 1.3190 3.2934 6.0144 1.4703 2.6290 1.4875 2.3944 2.2381 3.4282 2.5642 2.4109 1.6773 1.7522 2.3461 2.4373 1.8717 1.7737 2.4220 2.0535 2.5527 1.5581 1.1797 1.0554 1.6221 1.1115 1.3415 2.8987 1.5373 3.2050 1.2642 1.2233 1.4946 1.1667 1.2276 1.7669 1.2720 1.2935 3.1186 1.3835 1.4572 1.4514 1.5503 1.7109 1.4430 1.2262 3.6287 1.5481 4.2436 2.0591 1.1342 1.6697 1.3031 1.0904 1.1653 1.3735 1.0910 1.0615 1.0909 1.0887 3.0028 1.1002 2.1448 6.1402 7.5504 6.0682 7.6140 10.4651 1.0800 1.0707 1.0573 1.0632 1.0610 1.0641 1.0587 1.0612 1.0341 1.0988 1.0941 1.0898 1.1028 1.1029 1.1037 1.1011 1.1003 1.1012 1.0881 1.0858 1.0855 1.0908 1.0908 1.0960 1.0947 1.1014 1.0996 1.0747
irintensity: 0.2085 0.0366 0.1582 0.7073 0.8900 0.0766 0.2629 0.6243 0.2432 2.3238 0.4176 2.2477 0.8537 4.6945 1.4228 0.2899 0.9409 0.7046 0.7235 3.8135 5.8813 1.0899 2.5238 2.7918 2.0126 2.1056 0.2478 6.2063 3.0197 9.1165 10.6972 10.1479 2.1984 17.3135 5.7399 25.1227 12.1115 1.9216 1.6317 9.0765 16.2900 57.0688 4.5955 42.2290 18.5072 29.5758 0.8029 94.2997 2.2325 12.4138 1.8571 4.3713 4.2041 3.6131 0.1844 2.0153 0.9553 4.9373 2.0844 3.3340 6.5743 3.4168 0.1952 5.3776 0.1268 61.4817 0.0770 15.1909 56.7081 3.6722 10.2080 9.4200 5.4251 18.5291 6.3963 3.9092 7.4105 69.3699 5.9584 4.8802 18.2108 22.7465 2.3300 14.7424 3.6544 6.5606 0.2932 67.6413 0.7485 0.5008 2.7180 6.3112 7.7306 0.7324 1.3640 1.4375 0.4034 1.7628 25.7976 20.5994 31.1946 76.3372 0.3630 20.3631 4.2406 5.2125 3.6499 12.7506 23.4756 1.3826 3.1123 3.6126 8.6091 14.0138 25.0027 2.3470 9.3517 2.7666 39.4583 9.8426 12.1395 2.3180 5.9004 86.2391 10.3630 16.8311 0.0925 54.8565 6.4224 120.2075 167.4280 77.2073 131.4471 49.6253 34.3158 41.3500 26.1167 33.0467 33.4260 16.2133 21.4161 73.2161 47.5499 35.6515 17.0670 61.0449 50.7716 18.1794 10.4033 9.9969 1.1311 0.3675 8.6710 9.4272 39.4711 24.8805 21.6737 15.5453 2.0478
temp: 298.150 k
press: 1.00000 atm
elementType: 8 8 7 7 6 6 6 6 6 6 6 6 6 6 6 6 6 6 6 6 6 6 6 6 6 6 6 1 1 1 1 1 1 1 1 1 1 1 1 1 1 1 1 1 1 1 1 1 1 1 1 1 1 1 1
symmnumber: 1
zpe: 1212021.7 jmol-1
zpe.correction: 0.461635 hartree
zpe.thermalcorrener: 0.485877 hartree
zpe.thermalcorrenthalpy: 0.486821 hartree
zpe.thermalcorrgfe: 0.404556 hartree
zpe.sumelectzpe: -1151.212315 hartree
zpe.sumelectthermal: -1151.188073 hartree
zpe.sumelectthermalent: -1151.187129 hartree
zpe.sumelectthermalfe: -1151.269394 hartree
dipole: -1.4053 2.1823 2.5697
dipole: 3.6524
quadrupole: -146.4660 -153.5742 -168.1873
quadrupole: -0.3954 -8.2080 -1.6080
quadrupole: 9.6099 2.5017 -12.1115 -0.3954 -8.2080 -1.6080
hfenergy: -1151.6739501 hartree
pointgroup: C01 [X(C23H28N2O2)]
dipole: -0.1232949 -0.734331 -1.2289988 debye
polarizability: 257.0367742|1.1581635|269.3283124|11.7403748|27.584439|246.0885367 unknown
InChI: InChI=1S/C23H28N2O2/c1-23(27-16-14-19-11-7-8-15-24-19)20-12-5-6-13-21(20)25(22(23)26)17-18-9-3-2-4-10-18/h2-6,9-10,12-13,19,24H,7-8,11,14-17H2,1H3
charge 0 multiplicity 1
55 atoms
O  -0.57746 2.225192 1.308113
O  -1.596131 -0.286173 2.844576
N  4.260828 2.594815 1.00072
N  -2.217703 -0.775292 0.614888
C  3.145425 1.656517 0.721894
C  3.302863 1.119896 -0.722486
C  -1.876102 1.553155 1.117174
C  1.80647 2.392601 0.952521
C  4.696271 0.48083 -0.935928
C  5.822326 1.467552 -0.547737
C  5.604018 1.982415 0.890667
C  0.586789 1.481451 0.785408
C  -2.249387 1.340145 -0.346861
C  -1.862796 0.08209 1.671741
C  -2.446465 -0.044811 -0.587653
C  -2.876393 2.407421 1.910763
C  -2.335711 -2.2315 0.771137
C  -2.409121 2.26595 -1.386039
C  -2.814602 -0.534155 -1.853704
C  -2.780749 1.795191 -2.673676
C  -1.279037 -3.026535 0.005088
C  -2.98187 0.412509 -2.896905
C  -1.652059 -4.151849 -0.768673
C  0.09081 -2.671414 0.086555
C  -0.674412 -4.913954 -1.449209
C  1.068377 -3.427419 -0.595147
C  0.689184 -4.552202 -1.365847
H  3.180659 0.769653 1.413546
H  3.168491 1.968874 -1.421754
H  2.510824 0.3762 -0.937897
H  1.738984 3.253333 0.261888
H  1.78254 2.797945 1.984715
H  4.779417 -0.429651 -0.305113
H  4.811109 0.15393 -1.987079
H  5.815628 2.332208 -1.239039
H  6.812758 0.978409 -0.624225
H  4.1266 3.085844 1.895305
H  5.740668 1.122878 1.597726
H  6.362379 2.746267 1.144119
H  0.719812 0.5475 1.374349
H  0.418179 1.216399 -0.278175
H  -2.599994 2.386543 2.978091
H  -3.905856 2.027604 1.794569
H  -2.83641 3.448179 1.546442
H  -3.349352 -2.552866 0.463262
H  -2.237992 -2.414477 1.858974
H  -2.241218 3.333431 -1.206343
H  -2.948222 -1.603432 -2.041782
H  -2.909755 2.503567 -3.498716
H  -3.265593 0.061403 -3.895374
H  -2.709936 -4.436944 -0.837659
H  0.389404 -1.804987 0.688421
H  -0.976143 -5.783093 -2.044473
H  2.124643 -3.143592 -0.524167
H  1.448213 -5.138951 -1.89499
