program: Gaussian 09
title: 000037001
version: EM64L-G09RevD.01
frameworkgroup: C1[X(C23H28N2O)]
method: RPBEPBE
basis: SDD
operation: Freq
keyword: #p
keyword: freq=noraman
keyword: PBEPBE/SDD
title: #p freq=noraman PBEPBE/SDD
converged: NO YES NO NO
title: Mulliken charges:
elementType: O N N C C C C C C C C C C C C C C C C C C C C C C C H H H H H H H H H H H H H H H H H H H H H H H H H H H H
charge: -0.229095 -0.078564 -0.224579 0.070962 -0.442785 -0.344609 0.303429 0.063010 0.248852 -0.360610 -0.372037 -0.731987 -0.397147 -0.390694 -0.398893 -0.428181 -0.567970 -0.339474 -0.258511 -0.227101 0.510683 -0.450883 -0.352943 -0.217681 -0.232558 -0.244926 0.237209 0.206418 0.202253 0.214567 0.202118 0.172606 0.161130 0.215788 0.244763 0.214829 0.227425 0.205190 0.189539 0.190823 0.205139 0.188119 0.213178 0.239754 0.232064 0.266583 0.255237 0.225806 0.225126 0.232041 0.242171 0.227203 0.227505 0.229709
chargesum: 0.00000
title: Mulliken charges with hydrogens summed into heavy atoms:
elementType: O N N C C C C C C C C C C C C C C C C C C C C C C C
charge: -0.229095 -0.078564 -0.224579 0.070962 0.000841 0.072211 0.303429 0.063010 0.248852 0.014113 0.004880 -0.044970 -0.002418 0.005268 0.002405 -0.188427 -0.069323 -0.084237 -0.032704 -0.001975 0.510683 -0.218842 -0.110772 0.009521 -0.005053 -0.015217
polarizability: 2.80130724e+02 -1.67478775e+01 2.48780750e+02 -1.49714162e+01 -2.59052292e-02 2.33962404e+02
1716.lowfreq: -13.8099 -9.1676 0.0002 0.0005 0.0008 4.6332 14.8000 16.7979 21.6057
frequency: 11.9527 16.3897 21.1004 27.8915 37.1360 52.7386 67.4346 90.7759 112.8446 133.1811 163.4709 175.1674 183.9545 213.2992 220.1520 228.9871 236.9550 246.3357 267.1133 288.6106 312.4763 327.0166 355.8963 364.4189 381.5077 403.9109 407.9072 445.3527 451.2476 459.2973 477.0025 479.0478 543.8566 555.0473 562.1611 590.7830 613.1369 621.3175 645.4731 692.6851 704.0542 717.0419 742.1487 745.2096 756.7559 760.8400 767.0510 801.2867 803.7581 826.7175 852.5259 853.8493 854.6828 860.1002 864.4104 904.8185 915.6253 934.2775 939.1887 958.1328 976.1388 977.4361 984.2350 990.5610 994.2313 999.4861 1015.2250 1016.9963 1026.3048 1028.0441 1046.3235 1058.1784 1076.5879 1081.1240 1087.2181 1103.2791 1110.7646 1116.4909 1122.6472 1146.3544 1151.7748 1157.2786 1169.4067 1172.5963 1176.8680 1187.3915 1201.3754 1209.6656 1232.5359 1258.4580 1264.8763 1266.0064 1277.4437 1291.2722 1292.5542 1302.9819 1310.8071 1330.6479 1331.8967 1334.6917 1339.9775 1344.4270 1350.2603 1362.8699 1368.9928 1380.9728 1388.9618 1392.5422 1408.6342 1442.6406 1450.3039 1451.1584 1451.7035 1459.7868 1461.5300 1461.7524 1465.6216 1468.6490 1473.7270 1475.5986 1482.9248 1484.7986 1485.4813 1595.9791 1600.4848 1615.4752 1619.8538 1645.9234 2811.1731 2822.6902 2858.4078 2966.1010 2978.0252 2983.0333 2985.3436 2985.4317 2996.9039 3012.5805 3024.2062 3028.1007 3031.2362 3035.1185 3045.4937 3054.7077 3064.7106 3083.3436 3091.5481 3111.7546 3124.3689 3125.5881 3136.1486 3137.8621 3148.6206 3154.7813 3164.3261 3168.5528
redmass: 4.5396 4.2245 3.8605 3.1806 4.6099 4.4690 3.9225 4.0729 4.9398 3.7317 3.8293 3.5426 2.4429 1.7776 3.3366 1.9392 1.6397 2.1855 4.2191 2.5057 2.2614 4.6437 3.5363 4.0466 1.9129 2.8065 2.9190 2.9236 2.9453 3.2278 3.4775 6.1990 4.4020 2.1987 4.1457 3.3330 5.2696 4.5836 4.4064 5.6605 1.9759 3.2640 1.8747 2.7943 1.3036 3.5234 2.8838 3.6911 1.4908 2.0657 1.4151 1.2864 2.6674 2.5321 1.3973 2.2322 1.4876 1.4394 1.8881 1.3035 1.3123 1.3892 2.8441 6.2103 1.5996 1.9183 1.7484 2.5305 2.2075 2.7328 2.2907 2.2680 1.8005 2.3231 1.6530 2.3875 2.6915 2.0711 2.2113 1.4936 1.6076 2.4123 1.2427 1.0558 1.4666 1.1125 1.6901 2.8231 2.3333 1.3336 1.3196 1.2679 1.5335 1.3604 1.3968 1.6481 1.3845 1.3247 2.6984 1.5920 1.4209 1.4527 1.4458 1.8235 1.3848 1.2534 4.1600 1.3787 4.0107 2.0821 1.1202 1.0940 1.8590 1.0873 1.0868 1.3187 1.0888 1.1275 1.1458 1.0932 1.5309 1.5137 2.1604 6.2326 7.3253 6.1017 7.5307 9.9588 1.0714 1.0704 1.0691 1.0625 1.0587 1.0343 1.0606 1.0621 1.0617 1.0871 1.0868 1.0893 1.1021 1.0936 1.1033 1.1035 1.1020 1.1004 1.1008 1.0880 1.0868 1.0857 1.0895 1.0910 1.0956 1.0943 1.1014 1.0992
irintensity: 0.0181 0.1001 0.1599 0.1526 0.6412 0.0827 1.1994 0.2060 2.6118 0.4466 2.0532 1.4847 0.5051 0.0307 0.2908 0.5222 0.8924 0.4980 2.7819 2.7969 5.0762 5.5097 0.3507 1.3592 4.5831 0.1543 3.4790 0.5391 0.6822 9.3242 9.3390 2.7934 12.7877 1.6713 1.0940 7.0320 5.1964 7.7744 10.1524 2.8490 40.1279 5.5551 37.6108 2.9730 82.5901 7.3000 10.8697 11.9994 0.1839 2.1711 5.2365 1.5309 4.8820 2.6651 1.1091 1.4657 1.8026 2.4788 13.1938 3.0825 0.0690 0.2347 20.3226 0.1357 11.2066 17.0638 11.4708 10.6313 8.5987 3.7023 5.7229 4.6324 7.9014 5.1706 14.7806 21.5993 14.2350 10.3778 10.1101 6.2025 2.5660 34.5934 22.5794 0.2581 39.4793 0.8025 22.6869 0.8208 10.3561 2.6521 0.8818 7.2276 3.0507 5.9186 0.7043 23.6453 4.0563 6.4278 96.0684 19.1126 0.6711 10.3020 2.2078 3.9551 6.1005 15.3003 0.6268 1.5713 1.9523 10.8441 7.3313 9.1218 17.3730 12.6060 13.6509 30.2902 7.1361 14.0706 7.6485 2.2159 46.7178 40.4019 39.6615 3.1484 55.5283 9.8371 109.8493 155.3211 49.6704 91.0751 137.8248 36.3988 35.0811 26.4960 39.2795 34.5524 22.0108 9.0591 71.7571 66.7058 9.9347 32.6467 18.0453 89.3969 19.9118 23.2681 22.2518 9.5954 4.0956 0.1060 10.8184 14.5925 36.3615 28.3951 21.0092 15.6410
temp: 298.150 k
press: 1.00000 atm
elementType: 8 7 7 6 6 6 6 6 6 6 6 6 6 6 6 6 6 6 6 6 6 6 6 6 6 6 1 1 1 1 1 1 1 1 1 1 1 1 1 1 1 1 1 1 1 1 1 1 1 1 1 1 1 1
symmnumber: 1
zpe: 1202168.3 jmol-1
zpe.correction: 0.457882 hartree
zpe.thermalcorrener: 0.481756 hartree
zpe.thermalcorrenthalpy: 0.482700 hartree
zpe.thermalcorrgfe: 0.401039 hartree
zpe.sumelectzpe: -1076.080254 hartree
zpe.sumelectthermal: -1076.056380 hartree
zpe.sumelectthermalent: -1076.055436 hartree
zpe.sumelectthermalfe: -1076.137096 hartree
dipole: -0.7385 0.0995 3.2815
dipole: 3.3650
quadrupole: -141.1765 -146.7478 -165.4080
quadrupole: -2.3382 -0.8557 0.2193
quadrupole: 9.9342 4.3630 -14.2972 -2.3382 -0.8557 0.2193
hfenergy: -1076.5381357 hartree
pointgroup: C01 [X(C23H28N2O1)]
dipole: 0.176747 0.1230328 1.3062787 debye
polarizability: 274.2877948|-16.1838252|250.7205829|20.8258975|-4.8420859|237.8654999 unknown
InChI: InChI=1S/C23H28N2O/c1-23(14-17-24-15-8-3-9-16-24)20-12-6-7-13-21(20)25(22(23)26)18-19-10-4-2-5-11-19/h2,4-7,10-13H,3,8-9,14-18H2,1H3
charge 0 multiplicity 1
54 atoms
O  0.947536 0.324043 -2.943762
N  -3.171535 -0.382674 -0.545337
N  1.840807 0.633966 -0.774227
C  -0.11069 1.926787 -1.30531
C  -1.560304 1.352867 -1.369486
C  -1.740561 -0.006835 -0.660008
C  0.377599 2.197235 0.115027
C  0.915829 0.874414 -1.809654
C  1.535012 1.41428 0.374929
C  -3.846451 0.288149 0.595383
C  -3.382364 -1.852671 -0.503935
C  -0.011035 3.187224 -2.210517
C  -5.364401 0.015389 0.58485
C  -4.885109 -2.196194 -0.553426
C  -5.644227 -1.504715 0.601997
C  -0.114685 3.060777 1.104078
C  2.989138 -0.267257 -0.922715
C  2.214802 1.468335 1.60547
C  0.555936 3.133945 2.354469
C  1.705369 2.345489 2.596562
C  2.951954 -1.493065 -0.011446
C  4.142897 -1.962466 0.594057
C  1.745532 -2.20444 0.202446
C  4.133491 -3.129053 1.392676
C  1.732391 -3.367012 1.002846
C  2.926785 -3.835381 1.599559
H  -1.849456 1.238377 -2.429975
H  -2.238842 2.106594 -0.925526
H  -1.239395 0.015053 0.341196
H  -1.232474 -0.782886 -1.264082
H  -3.659069 1.375856 0.533363
H  -3.416644 -0.062991 1.572525
H  -2.936807 -2.302713 0.424836
H  -2.862903 -2.301945 -1.370878
H  -0.200123 2.906876 -3.261739
H  -0.761439 3.937417 -1.901686
H  0.988516 3.651887 -2.144533
H  -5.800617 0.462617 -0.329181
H  -5.832899 0.50867 1.458547
H  -5.013466 -3.29486 -0.504479
H  -5.29382 -1.851832 -1.523084
H  -5.305355 -1.929088 1.570264
H  -6.730487 -1.701189 0.52566
H  -1.003951 3.674419 0.918643
H  3.926764 0.298188 -0.755185
H  2.971413 -0.582958 -1.98454
H  3.092656 0.846326 1.804348
H  0.181664 3.803249 3.13649
H  2.211044 2.408213 3.566652
H  5.082852 -1.41736 0.437888
H  0.818382 -1.845349 -0.258431
H  5.062587 -3.482541 1.8539
H  0.792982 -3.908901 1.160627
H  2.916068 -4.738367 2.22005
