program: Gaussian 09
title: 000036852
version: EM64L-G09RevD.01
frameworkgroup: C1[X(C11H11NO2)]
method: RPBEPBE
basis: SDD
operation: Freq
keyword: #p
keyword: freq=noraman
keyword: PBEPBE/SDD
title: #p freq=noraman PBEPBE/SDD
converged: YES YES NO NO
title: Mulliken charges:
elementType: O O N C C C C C C C C C C C H H H H H H H H H H H
charge: -0.244890 -0.207755 -0.457777 0.211747 0.291709 0.290357 -0.506687 -0.347498 -0.416328 0.058281 -0.327835 -0.208954 -0.246013 -0.500276 0.336778 0.259976 0.240359 0.241398 0.218037 0.218094 0.226551 0.225855 0.200665 0.200742 0.243466
chargesum: 0.00000
title: Mulliken charges with hydrogens summed into heavy atoms:
elementType: O O N C C C C C C C C C C C
charge: -0.244890 -0.207755 -0.120999 0.211747 0.291709 0.290357 -0.246712 -0.107139 -0.174930 0.058281 0.108296 0.017596 -0.020157 0.144596
polarizability: 2.32476123e+02 1.13755762e+01 1.31933712e+02 5.10110515e-02 -9.39533383e-03 6.18782709e+01
1716.lowfreq: -12.1328 -0.0009 -0.0008 -0.0005 1.6409 5.2942 15.0134 44.2379 78.6174
frequency: 15.0067 44.2368 78.6174 95.8577 98.2855 199.4221 230.6939 250.2802 265.6423 270.8416 346.9650 372.2507 428.5915 519.4468 531.9676 569.4804 572.5691 604.6571 656.4988 667.1067 733.1284 747.0410 758.9549 803.9878 819.9640 861.9539 880.2178 899.1979 938.4318 942.6302 978.4712 987.1430 1008.3753 1044.0635 1094.3893 1115.0296 1118.6181 1147.8147 1165.2929 1176.8350 1194.7371 1222.8204 1235.9123 1318.4441 1331.5478 1360.6723 1398.8887 1413.3164 1433.2871 1450.3504 1454.7249 1460.1120 1475.9364 1488.8883 1530.4075 1579.7354 1587.5490 1632.0920 2895.0866 2925.6410 2935.6261 2998.2261 3112.1886 3129.9797 3138.6889 3152.2089 3167.4308 3213.9221 3574.6052
redmass: 2.1345 3.6496 4.2857 4.5054 5.1264 5.0448 1.1458 3.7790 5.6062 6.3585 5.4209 4.4139 2.9569 4.9256 3.4593 3.3378 6.2144 6.3583 1.1125 3.4774 5.8789 1.3667 2.7342 3.8554 1.4047 1.5946 5.3816 5.3650 6.3134 1.3815 1.3127 2.0550 2.2121 3.3978 3.1185 1.2649 1.6168 1.4104 1.2065 1.5150 1.0879 1.5008 2.1354 2.9339 1.7690 1.9309 4.6451 3.0165 1.1161 2.2156 1.5131 1.0503 1.0937 3.1758 5.2447 6.4822 8.4857 7.4976 1.0537 1.0352 1.1015 1.1028 1.0967 1.0851 1.0892 1.0959 1.1004 1.0978 1.0804
irintensity: 12.1874 3.5591 3.4921 0.4720 0.0548 2.8613 4.6160 0.1604 2.8928 0.3920 10.4396 4.6334 10.0707 2.9239 0.6660 0.0154 11.3440 0.9752 76.8512 11.3256 4.4748 40.2371 41.8096 0.0218 70.1845 6.0196 3.3760 34.4441 16.7401 5.8546 0.0014 0.4777 0.4062 94.0021 103.7757 0.1947 5.3133 138.0898 4.5622 31.8836 0.2615 111.8194 7.6118 53.8529 29.9399 39.3895 24.5316 9.6065 7.9669 40.3555 1.5649 13.4844 6.5447 1.2890 62.5185 61.1520 213.3646 15.8405 77.0366 85.6414 43.1413 75.6317 30.1020 0.0287 2.7410 28.5254 32.0143 2.8276 91.8040
temp: 298.150 k
press: 1.00000 atm
elementType: 8 8 7 6 6 6 6 6 6 6 6 6 6 6 1 1 1 1 1 1 1 1 1 1 1
symmnumber: 1
zpe: 513514.9 jmol-1
zpe.correction: 0.195587 hartree
zpe.thermalcorrener: 0.208203 hartree
zpe.thermalcorrenthalpy: 0.209147 hartree
zpe.thermalcorrgfe: 0.154500 hartree
zpe.sumelectzpe: -629.948664 hartree
zpe.sumelectthermal: -629.936049 hartree
zpe.sumelectthermalent: -629.935105 hartree
zpe.sumelectthermalfe: -629.989752 hartree
dipole: -1.4019 -3.2473 0.0253
dipole: 3.5371
quadrupole: -73.2769 -75.8989 -85.7751
quadrupole: -16.4387 0.0947 0.0090
quadrupole: 5.0400 2.4181 -7.4581 -16.4387 0.0947 0.0090
hfenergy: -630.1442516 hartree
pointgroup: C01 [X(C11H11N1O2)]
dipole: -0.5781365 -1.2657492 0.0127 debye
dipolederiv: -1.2348914 0.210259 0.0002741 0.1365747 -0.3334244 -0.0011449 0.0039522 -0.0016191 -0.4243646 -0.8783928 -0.0501661 -0.0002534 -0.6463958 -0.8887464 0.0018104 -0.0001865 0.001767 -0.3057736 -0.342409 0.1109014 -0.0002099 -0.2597657 -0.5096329 0.0003743 0.0002846 0.0002303 -0.2592868 0.1687082 0.1344495 -0.0002844 0.2033823 0.0297877 0.0000228 -0.0006732 0.0000515 0.0602676 -0.2070828 0.0540864 -0.0002854 -0.0595777 -0.1421471 0.0003562 -0.0000495 0.0002236 0.0154293 -1.3004036 -0.4011784 0.0003629 -0.4820319 0.2569957 -0.0002126 0.0012143 -0.0004773 0.0256242 0.3863488 -0.0727714 0.0002177 0.2335842 -0.0381892 -0.0004283 -0.0004693 -0.0001459 -0.2341727 0.0755333 -0.1169571 0.0002085 -0.069597 0.0448299 -0.0004429 0.0002132 -0.0004827 -0.1928202 0.298769 -0.0266921 0.0000697 0.1206089 0.1329736 -0.0005542 -0.0001468 -0.0004685 -0.1660548 2.0984758 0.1970691 0.0013087 0.3752348 0.9998002 -0.0036981 0.0041945 -0.0036899 0.1150523 0.6703079 0.1219428 -0.0028668 0.6338198 -0.115666 0.0036799 -0.0122849 0.0053735 0.4392259 -0.0974096 -0.0321407 0.0000443 -0.2611798 0.1063259 -0.0005327 0.0005059 -0.0004994 -0.1610943 -0.1780119 0.1142406 -0.000231 0.3546807 -0.0249071 -0.0002666 -0.0006258 -0.0003151 -0.1806886 0.6292699 -0.1771946 0.0015422 -0.4573551 0.4159748 0.001325 0.0048935 0.000347 0.3888017 0.2205365 -0.0235932 0.0001152 0.0666387 0.2608206 0.0001411 -0.0000974 0.0002535 0.3289498 0.0538933 0.0606885 0.0000069 0.0976657 0.008202 0.0002778 -0.0000262 0.0002103 0.1766209 0.0726106 -0.0104109 0.0000248 0.0498186 -0.0917315 0.0005073 -0.0000867 0.0005202 0.1784742 0.0822164 0.0397709 -0.0000658 -0.0174761 -0.0996515 0.0004831 0.0000156 0.000443 0.1613942 -0.1119251 -0.0204474 -0.0322847 -0.0960051 -0.0021137 -0.0945872 -0.0851276 -0.1019371 -0.0732329 -0.1124927 -0.0178027 0.0315801 -0.0923631 0.0020031 0.0937761 0.0869786 0.1001825 -0.0787442 -0.1053734 0.0810038 -0.0001514 0.0791776 0.0539167 0.0002058 -0.0001471 0.0002047 0.1609437 -0.0854471 -0.1057251 0.0001985 -0.1067123 0.015739 0.0002849 0.0001978 0.0002935 0.1665977 0.030497 -0.0140164 -0.0587475 0.1416683 -0.0696047 -0.1305451 0.0244234 -0.1452217 -0.1248202 0.0312432 -0.0113531 0.0575999 0.1419565 -0.0625713 0.1279005 -0.0294415 0.1437772 -0.1322691 -0.1645706 -0.0439629 0.0018268 -0.0863511 0.0510166 0.0012673 0.0024888 0.0009789 0.1159405 unknown
polarizability: 232.9078797|9.2632548|131.5016352|-0.0335098|-0.1530564|61.8785908 unknown
InChI: InChI=1S/C11H11NO2/c1-14-7-11(13)10-6-8-4-2-3-5-9(8)12-10/h2-6,12H,7H2,1H3
charge 0 multiplicity 1
25 atoms
O  4.312796 -0.038292 -0.010152
O  2.285811 1.797081 -0.005357
N  -0.433564 1.20859 -0.002743
C  -1.705068 0.649216 -0.001656
C  -1.542186 -0.789802 0.001031
C  0.531719 0.189217 -0.001038
C  -0.127176 -1.054618 0.001249
C  -2.980863 1.260997 -0.002794
C  -2.70003 -1.618065 0.002615
C  1.953885 0.574797 -0.001164
C  2.968701 -0.57329 0.003886
C  -4.103857 0.413707 -0.001177
C  -3.966383 -1.01051 0.0015
C  5.318143 -1.100211 -0.001474
H  -0.173197 2.195706 -0.004785
H  0.34861 -2.03435 0.002667
H  -3.094957 2.350081 -0.004859
H  -2.603548 -2.709254 0.004579
H  2.778687 -1.218633 -0.886013
H  2.78985 -1.199427 0.909804
H  -5.107831 0.852388 -0.00199
H  -4.869202 -1.630732 0.002664
H  5.233008 -1.753774 -0.896397
H  5.241626 -1.730516 0.910727
H  6.294125 -0.591905 -0.012723
