program: Gaussian 09
title: 000036851
version: EM64L-G09RevD.01
frameworkgroup: C1[X(C12H8ClFN2O)]
method: RPBEPBE
basis: SDD
operation: Freq
keyword: #p
keyword: freq=noraman
keyword: PBEPBE/SDD
title: #p freq=noraman PBEPBE/SDD
converged: YES YES NO NO
title: Mulliken charges:
elementType: Cl F O N N C C C C C C C C C C C C H H H H H H H H
charge: -0.049076 -0.219134 -0.276777 -0.425527 -0.075998 0.063475 0.174349 0.187257 0.235773 -0.292900 -0.345631 -0.235828 -0.261890 -0.190838 -0.126971 -0.046593 -0.362267 0.372140 0.285967 0.314020 0.262702 0.240573 0.242757 0.264103 0.266315
chargesum: 0.00000
title: Mulliken charges with hydrogens summed into heavy atoms:
elementType: Cl F O N N C C C C C C C C C C C C
charge: -0.049076 -0.219134 -0.276777 -0.053387 -0.075998 0.063475 0.174349 0.187257 0.235773 -0.006933 -0.082930 0.004745 0.052129 0.051919 0.137132 -0.046593 -0.095952
polarizability: 3.00916008e+02 7.28905193e+00 1.49815607e+02 1.76155444e-02 1.20563537e-02 5.86471082e+01
1716.lowfreq: -6.5733 -5.2581 -0.0020 -0.0015 0.0010 2.4870 29.2033 39.5966 72.7564
frequency: 29.1704 39.3770 72.7515 75.1382 125.9063 168.2809 174.6529 223.7721 250.1949 283.2143 334.5986 352.6001 368.1315 409.2237 421.2626 437.7799 502.8097 515.1997 520.7696 521.9570 614.0780 627.4151 668.8363 678.2784 743.1646 747.6160 778.6263 781.9447 805.8843 835.4803 851.1411 875.7982 876.4229 908.3056 968.8250 973.0778 984.8017 1003.9937 1027.8825 1065.8626 1086.5363 1112.8228 1123.3555 1158.3409 1173.9328 1222.8977 1253.7659 1274.9988 1289.6905 1343.6650 1364.0326 1382.9720 1433.2321 1440.3892 1464.0880 1511.8480 1557.7395 1566.9031 1572.9406 1601.5707 1621.0763 3145.5999 3156.6202 3158.2533 3170.8195 3170.9609 3183.3689 3200.4248 3466.8955
redmass: 7.5043 6.5580 8.4552 7.4953 5.9437 6.4560 10.8914 8.8072 5.8909 8.2699 6.0226 10.6816 6.5446 12.0216 3.9129 3.6047 3.1377 6.8132 3.4010 9.4943 7.5852 8.3263 4.5165 7.0660 3.3354 3.8040 1.3778 7.2026 1.3114 5.8020 1.4505 7.3603 1.4167 1.3770 1.3525 5.2339 1.3164 1.3337 2.2914 4.3982 2.6690 1.7813 1.3722 1.7784 1.3743 1.9122 2.0618 2.1698 1.5769 5.2507 3.2866 8.0599 2.4909 2.4538 2.5833 2.5368 7.7983 5.1797 5.5423 5.7081 6.8482 1.0865 1.0932 1.0908 1.0922 1.0957 1.0996 1.0964 1.0772
irintensity: 1.0947 0.1182 0.6582 6.1538 1.8167 0.2381 4.7244 2.0597 0.0205 12.5362 0.0486 0.1424 4.0854 34.5950 2.8204 0.7688 29.1631 7.9716 2.0281 8.3207 1.8697 2.9763 7.3565 17.2871 0.9204 14.4204 84.9878 10.1982 82.7955 23.3264 61.9379 12.4328 0.5117 6.0413 2.8466 31.3461 1.9268 0.6193 13.8857 23.5623 85.1453 2.7287 5.5787 16.7763 6.3816 21.3462 8.2854 42.3955 90.9553 1.9052 166.2641 5.4268 89.2442 36.2738 95.4213 831.3834 57.5430 23.2454 14.7055 121.0989 18.8677 3.5151 8.8133 2.6285 1.5671 11.9074 10.8092 7.9248 95.0029
temp: 298.150 k
press: 1.00000 atm
elementType: 17 9 8 7 7 6 6 6 6 6 6 6 6 6 6 6 6 1 1 1 1 1 1 1 1
symmnumber: 1
zpe: 459688.8 jmol-1
zpe.correction: 0.175086 hartree
zpe.thermalcorrener: 0.189111 hartree
zpe.thermalcorrenthalpy: 0.190055 hartree
zpe.thermalcorrgfe: 0.132347 hartree
zpe.sumelectzpe: -1205.543668 hartree
zpe.sumelectthermal: -1205.529644 hartree
zpe.sumelectthermalent: -1205.528700 hartree
zpe.sumelectthermalfe: -1205.586408 hartree
dipole: 3.8445 -0.0737 0.0050
dipole: 3.8452
quadrupole: -84.3474 -103.3716 -107.5846
quadrupole: -3.6375 -0.0013 0.0124
quadrupole: 14.0871 -4.9371 -9.1500 -3.6375 -0.0013 0.0124
hfenergy: -1205.7187546 hartree
pointgroup: C01 [X(C12H8Cl1F1N2O1)]
dipole: -1.5119953 -0.041724 0.0282008 debye
dipolederiv: -1.0824465 0.0341607 0.0198596 -0.0028638 -0.108904 0.0005023 0.0198171 -0.0002503 -0.0555303 -0.6185805 0.3316975 0.0071204 0.2511509 -0.6762361 -0.0013634 0.0075414 -0.002978 -0.1417191 -0.7885563 -0.1727755 0.0095184 0.3694699 -0.8924014 -0.0043277 0.0058946 0.0068395 -0.3524797 -2.1662963 0.2761035 0.0351411 0.4882162 -0.4722917 -0.0089421 0.0336551 -0.004691 -0.3090658 -0.6667374 -0.074342 0.0093915 0.1303485 -0.3081318 -0.0020875 0.0080506 0.0020416 -0.2348485 -0.5832285 -0.1413616 0.0116659 -0.1378286 -0.2301977 0.0040437 0.0116623 0.0039735 -0.0288187 2.1676818 0.0442861 -0.0380433 -0.8557412 1.1485786 0.0118916 -0.0314088 -0.0064944 0.2471273 1.8042001 -0.1247498 -0.032746 0.3363458 0.0533888 -0.0061929 -0.0363299 0.0029591 0.1353467 0.624388 -0.3758651 -0.0079432 -0.0811003 0.727606 -0.0026341 -0.0096648 0.0031317 0.0840527 0.0932937 0.105268 -0.0040937 -0.1382405 0.0246856 0.0020844 -0.0026485 -0.0026675 -0.0905724 -0.3153036 0.151118 0.0023723 0.0423609 -0.0255692 -0.0016419 0.0028841 -0.0036811 -0.1453877 -0.0859101 -0.2001395 -0.0002423 -0.2397302 -0.0313437 0.0038316 0.0000397 0.0029171 -0.1632851 -0.4853343 0.0444312 0.0072271 -0.2969661 -0.0541931 0.0053922 0.010071 -0.0013702 -0.1123212 0.098041 0.0071682 -0.0043725 0.0358145 0.112868 -0.0021196 -0.0046011 -0.0015891 -0.1317477 0.0059275 0.0002507 -0.0018812 0.0261534 0.1468663 -0.0024068 -0.002428 -0.0017924 -0.0770455 1.3282518 -0.0824603 -0.0258826 0.226231 -0.1527312 -0.0036638 -0.0279353 0.002414 -0.044109 -0.1236464 0.0880743 0.0009101 -0.2659377 0.3234363 0.0026679 0.0036824 -0.0043264 -0.0275229 0.3709676 0.0548948 -0.0013428 0.0653132 0.2358578 -0.0007176 -0.0016111 -0.0004055 0.3147531 0.1888957 -0.0467189 -0.0004544 -0.0151872 0.0331646 0.0009806 -0.0006141 0.0016708 0.1537835 0.193509 0.0543245 -0.0007816 0.021135 0.068219 0.0005612 -0.0004105 -0.0001462 0.1800816 0.0799244 -0.0246105 0.0021356 -0.041784 -0.0226244 0.0021005 0.0022182 0.0018001 0.1832283 -0.0220028 0.083878 0.0030939 0.1049895 -0.005984 -0.000981 0.0028786 -0.000549 0.166556 -0.0939606 -0.0409083 0.005118 -0.0454048 0.0861908 0.0013311 0.0051798 0.0012374 0.1603967 0.0566879 -0.0581485 0.0024562 -0.0665089 0.016822 0.002479 0.0025126 0.0022909 0.1544034 0.0202347 0.0664244 0.0017735 0.0897645 0.0029244 -0.0007878 0.0015645 -0.0003345 0.1347244 unknown
polarizability: 300.9355291|-6.0292734|149.6995379|-4.7293441|-0.5028922|58.7436564 unknown
InChI: InChI=1S/C12H8ClFN2O/c13-8-5-6-11(15-7-8)16-12(17)9-3-1-2-4-10(9)14/h1-7,16H
charge 0 multiplicity 1
25 atoms
Cl 6.2106 -0.090191 -0.073618
F  -1.737174 -2.127996 0.096688
O  -0.46359 1.993428 0.045809
N  0.237037 -0.23937 0.045883
N  2.307253 -1.266258 0.012263
C  -2.178173 0.291252 0.089909
C  -0.738832 0.752246 0.059031
C  1.638969 -0.070738 0.016259
C  -2.657667 -1.039536 0.107422
C  -3.169358 1.311561 0.103295
C  -4.017068 -1.381703 0.13558
C  -4.543582 1.008019 0.131214
C  2.301547 1.186961 -0.007321
C  -4.971951 -0.341422 0.147391
C  3.711411 1.18809 -0.035539
C  4.392944 -0.045495 -0.038933
C  3.665189 -1.253584 -0.014902
H  -0.055743 -1.224267 0.059292
H  -2.807754 2.344855 0.090383
H  1.720812 2.110126 -0.003563
H  -4.307595 -2.435859 0.147787
H  -5.279931 1.817531 0.140256
H  -6.038684 -0.586341 0.16926
H  4.263789 2.131767 -0.054424
H  4.17085 -2.224177 -0.017623
