program: Gaussian 09
title: 000036867
version: EM64L-G09RevD.01
frameworkgroup: C1[X(C12H16ClNOS)]
method: RPBEPBE
basis: SDD
operation: Freq
keyword: #p
keyword: freq=noraman
keyword: PBEPBE/SDD
title: #p freq=noraman PBEPBE/SDD
converged: YES YES NO NO
title: Mulliken charges:
elementType: Cl S O N C C C C C C C C C C C C H H H H H H H H H H H H H H H H
charge: -0.044716 0.088064 -0.249210 -0.090931 -0.356371 -0.374016 0.010596 -0.651923 -0.640488 -0.824306 0.654780 -0.311186 -0.382597 -0.219257 -0.229865 -0.229619 0.257790 0.210112 0.242869 0.221241 0.207942 0.248149 0.217845 0.211395 0.249155 0.216337 0.272130 0.336054 0.238679 0.254460 0.232224 0.234663
chargesum: 0.00000
title: Mulliken charges with hydrogens summed into heavy atoms:
elementType: Cl S O N C C C C C C C C C C C C
charge: -0.044716 0.088064 -0.249210 -0.090931 0.111531 0.090094 0.010596 0.022013 0.036399 -0.216121 0.654780 -0.311186 -0.143918 0.035203 0.002359 0.005044
polarizability: 2.39473171e+02 2.06924224e+01 1.46169978e+02 -8.74901338e+00 3.00913949e+00 1.24792557e+02
1716.lowfreq: -12.9125 -5.3087 -0.0021 -0.0018 -0.0018 3.6578 16.4190 23.8065 28.3358
frequency: 14.7026 23.5468 28.2316 45.9580 76.2783 84.0880 100.9266 134.5940 138.0530 162.1170 198.6161 203.3071 239.2194 248.2837 303.4495 312.0357 351.2906 361.3978 405.4179 424.1285 447.3140 459.9890 492.2325 512.9584 571.7819 622.9378 632.9093 652.4490 661.9983 738.0606 765.4479 769.9258 781.8110 817.5702 834.1657 867.7538 900.6199 940.3186 949.8233 985.0916 1004.2962 1021.7900 1039.6427 1073.2525 1079.7783 1094.8684 1107.8924 1115.9272 1160.5605 1175.6238 1207.5628 1219.2639 1237.7089 1253.1142 1281.8023 1295.8274 1340.4604 1355.9459 1376.4377 1382.6511 1386.1069 1390.8504 1424.9549 1457.5030 1461.7718 1466.5337 1466.9625 1467.7357 1478.4774 1480.9268 1489.0430 1575.3067 1604.8290 1629.3831 2985.9030 2986.1257 2998.2901 3007.6284 3008.3905 3051.3096 3069.9897 3082.5978 3085.9749 3098.8184 3102.1304 3102.6852 3127.6813 3141.6864 3159.4169 3174.2447
redmass: 3.9691 4.7960 4.9156 3.3324 2.9753 6.2423 8.6292 3.8946 3.8643 5.4433 1.6320 1.0584 2.6001 3.1408 3.7388 2.9052 3.7787 4.1346 3.9407 3.8540 3.7291 4.2920 3.4046 4.4426 5.7039 9.5833 4.2247 5.3271 6.6296 2.8550 1.4270 1.3065 1.2062 4.4800 2.2469 1.4031 1.6005 2.0870 1.3959 1.3314 2.7197 6.6402 2.1212 2.0420 1.8944 1.8260 1.9771 1.6078 1.0879 1.0576 2.8349 2.3573 1.6206 1.2177 1.4590 1.3031 1.2615 1.2900 8.1020 1.3672 1.6311 1.2635 2.1419 1.0793 1.4995 1.0472 1.5737 1.0664 1.0609 1.0570 1.0871 6.1264 7.1468 8.3898 1.0356 1.0357 1.0615 1.0623 1.0628 1.1019 1.1000 1.0996 1.0990 1.1015 1.1028 1.1023 1.0872 1.0895 1.0949 1.0997
irintensity: 1.0461 0.2851 0.6519 1.0113 0.1544 3.4210 0.2841 0.0049 1.6958 1.4300 2.2239 0.4819 0.7670 2.1690 1.8324 9.6273 20.6228 8.0684 2.6844 3.8837 5.9053 8.8689 3.0787 1.5076 12.3051 9.4353 48.6448 7.0006 11.7046 22.9172 56.5872 6.9244 2.8709 29.6657 69.1073 0.4194 2.5278 6.5749 2.3448 0.0436 3.1332 43.9544 2.4108 30.7935 7.4640 43.5982 126.7802 10.9821 4.7352 0.6810 60.8225 2.7755 118.8102 7.7615 2.8210 31.5132 3.4947 8.6211 0.9731 67.7262 59.3334 37.3307 21.6244 22.8144 27.1686 3.4696 27.5700 3.1962 12.1320 9.9699 20.5969 10.5668 0.7661 265.6406 27.4190 24.8624 31.8051 50.9013 13.8278 12.3869 6.7320 37.2892 36.6967 24.9718 11.3954 38.4028 4.9153 9.9235 17.9606 15.8768
temp: 298.150 k
press: 1.00000 atm
elementType: 17 16 8 7 6 6 6 6 6 6 6 6 6 6 6 6 1 1 1 1 1 1 1 1 1 1 1 1 1 1 1 1
symmnumber: 1
zpe: 670198.6 jmol-1
zpe.correction: 0.255265 hartree
zpe.thermalcorrener: 0.272994 hartree
zpe.thermalcorrenthalpy: 0.273939 hartree
zpe.thermalcorrgfe: 0.206188 hartree
zpe.sumelectzpe: -1453.776042 hartree
zpe.sumelectthermal: -1453.758313 hartree
zpe.sumelectthermalent: -1453.757369 hartree
zpe.sumelectthermalfe: -1453.825120 hartree
dipole: 0.8586 -1.3836 2.1886
dipole: 2.7279
quadrupole: -82.6843 -108.1585 -112.8796
quadrupole: 3.2053 3.3280 3.8299
quadrupole: 18.5565 -6.9177 -11.6388 3.2053 3.3280 3.8299
hfenergy: -1454.0313077 hartree
pointgroup: C01 [X(C12H16Cl1N1O1S1)]
dipole: 0.3296432 0.3583738 0.9564229 debye
polarizability: 239.5570472|6.6751217|135.6676455|-21.1480157|-11.2893489|135.2110141 unknown
InChI: InChI=1S/C12H16ClNOS/c1-3-14(4-2)12(15)16-9-10-7-5-6-8-11(10)13/h5-8H,3-4,9H2,1-2H3
charge 0 multiplicity 1
32 atoms
Cl -1.109262 1.094415 -1.747797
S  0.590808 -0.629753 1.089008
O  1.814994 -1.095878 -1.357045
N  3.107565 0.084006 0.188314
C  4.239156 0.181027 -0.772703
C  3.270351 0.719823 1.515923
C  1.968555 -0.568579 -0.221817
C  5.230455 -0.993295 -0.638416
C  2.838214 2.201921 1.531111
C  -0.720431 -1.507581 0.014489
C  -2.052385 -0.808452 0.095557
C  -2.362544 0.363904 -0.639121
C  -3.076687 -1.32565 0.934761
C  -3.614849 1.001959 -0.559288
C  -4.340218 -0.70542 1.034809
C  -4.610878 0.46236 0.286152
H  3.815647 0.20023 -1.790872
H  4.747207 1.146893 -0.592981
H  2.695874 0.146884 2.266068
H  4.336399 0.627345 1.796809
H  5.652907 -1.053333 0.381312
H  4.724345 -1.947092 -0.864326
H  6.068115 -0.868245 -1.348951
H  3.414254 2.793472 0.796489
H  1.765927 2.293829 1.287784
H  3.007414 2.639597 2.532077
H  -0.789038 -2.541806 0.38376
H  -0.272999 -1.503429 -0.996469
H  -2.865426 -2.231562 1.515239
H  -3.807799 1.902167 -1.150105
H  -5.107794 -1.130025 1.690276
H  -5.587377 0.953566 0.353053
